Code Repositories

Find and share code repositories
Announcements
Welcome to the upgraded Community! Read this blog to see What’s New!
Labels (1)
avatar
Rising Star
Repo DescriptionRepo Info
Github Repo URL https://github.com/geetha-hortonworks/hive-testbench
Github account name geetha-hortonworks
Repo name hive-testbench
4,802 Views
Comments
avatar
Explorer

p tpcds_kit.zip target/tpcds_kit.zip test -d target/tools/ || (cd target; unzip tpcds_kit.zip) Archive: tpcds_kit.zip End-of-central-directory signature not found. Either this file is not a zipfile, or it constitutes one disk of a multi-part archive. In the latter case the central directory and zipfile comment will be found on the last disk(s) of this archive. unzip: cannot find zipfile directory in one of tpcds_kit.zip or tpcds_kit.zip.zip, and cannot find tpcds_kit.zip.ZIP, period. make: *** [target/tools/dsdgen] Error 9 TPC-DS Data Generator built, you can now use tpcds-setup.sh to generate data.

I am getting this error , I am unable to generate the data

avatar
avatar
Explorer

@Constantin Stanca I am facing a issue with maven plugin..

mvn package [INFO] Scanning for projects... [WARNING] [WARNING] Some problems were encountered while building the effective model for org.notmysock.tpcds:tpcds-gen:jar:1.0-SNAPSHOT [WARNING] 'build.plugins.plugin.version' for org.apache.maven.plugins:maven-compiler-plugin is missing. @ line 47, column 15 [WARNING] 'build.plugins.plugin.version' for org.apache.maven.plugins:maven-jar-plugin is missing. @ line 54, column 15 [WARNING] [WARNING] It is highly recommended to fix these problems because they threaten the stability of your build. [WARNING] [WARNING] For this reason, future Maven versions might no longer support building such malformed projects. [WARNING] [INFO] [INFO] ------------------------------------------------------------------------ [INFO] Building tpcds-gen 1.0-SNAPSHOT [INFO] ------------------------------------------------------------------------ [WARNING] The POM for org.apache.maven.plugins:maven-resources-plugin:jar:2.5 is invalid, transitive dependencies (if any) will not be available, enable debug logging for more details [WARNING] The POM for org.apache.maven.plugins:maven-compiler-plugin:jar:2.3.2 is invalid, transitive dependencies (if any) will not be available, enable debug logging for more details [WARNING] The POM for org.apache.maven.plugins:maven-surefire-plugin:jar:2.10 is invalid, transitive dependencies (if any) will not be available, enable debug logging for more details [WARNING] The POM for org.apache.maven.plugins:maven-jar-plugin:jar:2.3.2 is invalid, transitive dependencies (if any) will not be available, enable debug logging for more details [WARNING] The POM for org.apache.maven.plugins:maven-dependency-plugin:jar:2.1 is invalid, transitive dependencies (if any) will not be available, enable debug logging for more details [INFO] ------------------------------------------------------------------------ [INFO] BUILD FAILURE [INFO] ------------------------------------------------------------------------ [INFO] Total time: 0.912s [INFO] Finished at: Thu Oct 27 20:02:12 UTC 2016 [INFO] Final Memory: 7M/152M [INFO] ------------------------------------------------------------------------ [ERROR] Failed to parse plugin descriptor for org.apache.maven.plugins:maven-dependency-plugin:2.1 (/root/.m2/repository/org/apache/maven/plugins/maven-dependency-plugin/2.1/maven-dependency-plugin-2.1.jar): error in opening zip file -> [Help 1] [ERROR] [ERROR] To see the full stack trace of the errors, re-run Maven with the -e switch. [ERROR] Re-run Maven using the -X switch to enable full debug logging. [ERROR] [ERROR] For more information about the errors and possible solutions, please read the following articles: [ERROR] [Help 1] http://cwiki.apache.org/confluence/display/MAVEN/PluginDescriptorParsingException make: *** [target/tpcds-gen-1.0-SNAPSHOT.jar] Error 1