Support Questions
Find answers, ask questions, and share your expertise

Pyarrow-0.9.0 installation

Pyarrow-0.9.0 installation

New Contributor

Hello! I'm facing some problems while  trying to install pyarrow-0.9.0.

 

This is the command i used to install after downloading the package from https://pypi.org/project/pyarrow/0.9.0/:

/opt/cloudera/parcels/Anaconda-5.3.1/bin/python2.7 setup.py install

This is the error shown in the console:

running install
running bdist_egg
running egg_info
writing requirements to pyarrow.egg-info/requires.txt
writing pyarrow.egg-info/PKG-INFO
writing top-level names to pyarrow.egg-info/top_level.txt
writing dependency_links to pyarrow.egg-info/dependency_links.txt
writing entry points to pyarrow.egg-info/entry_points.txt
reading manifest file 'pyarrow.egg-info/SOURCES.txt'
reading manifest template 'MANIFEST.in'
warning: no previously-included files matching '*.so' found anywhere in distribution
warning: no previously-included files matching '*.pyc' found anywhere in distribution
warning: no previously-included files matching '*~' found anywhere in distribution
warning: no previously-included files matching '#*' found anywhere in distribution
warning: no previously-included files matching '.git*' found anywhere in distribution
warning: no previously-included files matching '.DS_Store' found anywhere in distribution
writing manifest file 'pyarrow.egg-info/SOURCES.txt'
installing library code to build/bdist.linux-x86_64/egg
running install_lib
running build_py
running build_ext
-- Runnning cmake for pyarrow
cmake -DPYTHON_EXECUTABLE=/opt/cloudera/parcels/Anaconda-5.3.1/bin/python2.7 -DPYARROW_BOOST_USE_SHARED=on -DPYARROW_BUNDLE_BOOST=OFF -DCMAKE_BUILD_TYPE=debug /root/pyarrow-0.9.0
INFOCompiler command: /bin/c++
INFOCompiler version: Using built-in specs.
COLLECT_GCC=/bin/c++
COLLECT_LTO_WRAPPER=/usr/libexec/gcc/x86_64-redhat-linux/4.8.5/lto-wrapper
Target: x86_64-redhat-linux
Configured with: ../configure --prefix=/usr --mandir=/usr/share/man --infodir=/usr/share/info --with-bugurl=http://bugzilla.redhat.com/bugzilla --enable-bootstrap --enable-shared --enable-threads=posix --enable-checking=release --with-system-zlib --enable-__cxa_atexit --disable-libunwind-exceptions --enable-gnu-unique-object --enable-linker-build-id --with-linker-hash-style=gnu --enable-languages=c,c++,objc,obj-c++,java,fortran,ada,go,lto --enable-plugin --enable-initfini-array --disable-libgcj --with-isl=/builddir/build/BUILD/gcc-4.8.5-20150702/obj-x86_64-redhat-linux/isl-install --with-cloog=/builddir/build/BUILD/gcc-4.8.5-20150702/obj-x86_64-redhat-linux/cloog-install --enable-gnu-indirect-function --with-tune=generic --with-arch_32=x86-64 --build=x86_64-redhat-linux
Thread model: posix
gcc version 4.8.5 20150623 (Red Hat 4.8.5-44) (GCC)

INFOCompiler id: GNU
Selected compiler gcc 4.8.5
Configured for DEBUG build (set with cmake -DCMAKE_BUILD_TYPE={release,debug,...})
-- Build Type: DEBUG
-- Build output directory: /root/pyarrow-0.9.0/build/temp.linux-x86_64-2.7/debug/
-- Searching for Python libs in /opt/cloudera/parcels/Anaconda-5.3.1/lib64;/opt/cloudera/parcels/Anaconda-5.3.1/lib;/opt/cloudera/parcels/Anaconda-5.3.1/lib/python2.7/config
-- Looking for python2.7
-- Found Python lib /opt/cloudera/parcels/Anaconda-5.3.1/lib/libpython2.7.so
-- Searching for Python libs in /opt/cloudera/parcels/Anaconda-5.3.1/lib64;/opt/cloudera/parcels/Anaconda-5.3.1/lib;/opt/cloudera/parcels/Anaconda-5.3.1/lib/python2.7/config
-- Looking for python2.7
-- Found Python lib /opt/cloudera/parcels/Anaconda-5.3.1/lib/libpython2.7.so
CMake Warning (dev) at /usr/lib64/python2.7/site-packages/cmake/data/share/cmake-3.18/Modules/FindPackageHandleStandardArgs.cmake:273 (message):
The package name passed to `find_package_handle_standard_args` (PkgConfig)
does not match the name of the calling package (Arrow). This can lead to
problems in calling code that expects `find_package` result variables
(e.g., `_FOUND`) to follow a certain pattern.
Call Stack (most recent call first):
/usr/lib64/python2.7/site-packages/cmake/data/share/cmake-3.18/Modules/FindPkgConfig.cmake:59 (find_package_handle_standard_args)
cmake_modules/FindArrow.cmake:27 (include)
CMakeLists.txt:197 (find_package)
This warning is for project developers. Use -Wno-dev to suppress it.

-- Arrow ABI version: 200
-- Arrow SO version: 200
-- Found the Arrow core library: /usr/lib64/libarrow.so
-- Found the Arrow Python library: ARROW_PYTHON_LIB_PATH-NOTFOUND
Added shared library dependency arrow: /usr/lib64/libarrow.so
Added shared library dependency arrow_python: /usr/lib64/libarrow_python.so
-- Configuring done
-- Generating done
-- Build files have been written to: /root/pyarrow-0.9.0/build/temp.linux-x86_64-2.7
-- Finished cmake for pyarrow
-- Running cmake --build for pyarrow
make
[ 33%] Compiling Cython CXX source for lib...
[ 33%] Built target lib_pyx
Scanning dependencies of target lib
[ 66%] Building CXX object CMakeFiles/lib.dir/lib.cxx.o
/root/pyarrow-0.9.0/build/temp.linux-x86_64-2.7/lib.cxx:593:35: fatal error: arrow/python/platform.h: No such file or directory
#include "arrow/python/platform.h"
^
compilation terminated.
make[2]: *** [CMakeFiles/lib.dir/lib.cxx.o] Error 1
make[1]: *** [CMakeFiles/lib.dir/all] Error 2
make: *** [all] Error 2
error: command 'make' failed with exit status 2

 

 

Thank you

5 REPLIES 5
Highlighted

Re: Pyarrow-0.9.0 installation

Cloudera Employee

To debug these problems, it would be good to have answers to the following questions:

  • Does /usr/local/include/arrow/python/platform.h exist?
  • Does setting export ARROW_HOME=/usr/local help?
Highlighted

Re: Pyarrow-0.9.0 installation

Explorer

The path /usr/local/include/arrow/python/platform.h doesn't exist, I have only /usr/local/include/arrow/

exporting ARROW_HOME variable doesn't help 

Highlighted

Re: Pyarrow-0.9.0 installation

Cloudera Employee

Then this could be an issue with the file permissions or the ownership.

Can you share the  /opt/cloudera/parcels/Anaconda-5.3.1/bin/python2.7 setup.py file contents ?

Attaching it could be a good idea.

Highlighted

Re: Pyarrow-0.9.0 installation

Explorer

content of  /opt/cloudera/parcels/Anaconda-5.3.1/bin/python2.7 setup.py file 

#!/usr/bin/env python

# Licensed to the Apache Software Foundation (ASF) under one
# or more contributor license agreements.  See the NOTICE file
# distributed with this work for additional information
# regarding copyright ownership.  The ASF licenses this file
# to you under the Apache License, Version 2.0 (the
# "License"); you may not use this file except in compliance
# with the License.  You may obtain a copy of the License at
#
#   http://www.apache.org/licenses/LICENSE-2.0
#
# Unless required by applicable law or agreed to in writing,
# software distributed under the License is distributed on an
# "AS IS" BASIS, WITHOUT WARRANTIES OR CONDITIONS OF ANY
# KIND, either express or implied.  See the License for the
# specific language governing permissions and limitations
# under the License.

import contextlib
import glob
import os
import os.path as osp
import re
import shlex
import shutil
import sys

from Cython.Distutils import build_ext as _build_ext
import Cython


import pkg_resources
from setuptools import setup, Extension, Distribution

from os.path import join as pjoin

from distutils.command.clean import clean as _clean
from distutils.util import strtobool
from distutils import sysconfig

# Check if we're running 64-bit Python
is_64_bit = sys.maxsize > 2**32

if Cython.__version__ < '0.19.1':
    raise Exception('Please upgrade to Cython 0.19.1 or newer')

setup_dir = os.path.abspath(os.path.dirname(__file__))


@contextlib.contextmanager
def changed_dir(dirname):
    oldcwd = os.getcwd()
    os.chdir(dirname)
    try:
        yield
    finally:
        os.chdir(oldcwd)


class clean(_clean):

    def run(self):
        _clean.run(self)
        for x in []:
            try:
                os.remove(x)
            except OSError:
                pass


class build_ext(_build_ext):
    _found_names = ()

    def build_extensions(self):
        numpy_incl = pkg_resources.resource_filename('numpy', 'core/include')

        self.extensions = [ext for ext in self.extensions
                           if ext.name != '__dummy__']

        for ext in self.extensions:
            if (hasattr(ext, 'include_dirs') and
                    numpy_incl not in ext.include_dirs):
                ext.include_dirs.append(numpy_incl)
        _build_ext.build_extensions(self)

    def run(self):
        self._run_cmake()
        _build_ext.run(self)

    # adapted from cmake_build_ext in dynd-python
    # github.com/libdynd/dynd-python

    description = "Build the C-extensions for arrow"
    user_options = ([('extra-cmake-args=', None, 'extra arguments for CMake'),
                     ('build-type=', None, 'build type (debug or release)'),
                     ('boost-namespace=', None,
                      'namespace of boost (default: boost)'),
                     ('with-parquet', None, 'build the Parquet extension'),
                     ('with-static-parquet', None, 'link parquet statically'),
                     ('with-static-boost', None, 'link boost statically'),
                     ('with-plasma', None, 'build the Plasma extension'),
                     ('with-orc', None, 'build the ORC extension'),
                     ('bundle-boost', None,
                      'bundle the (shared) Boost libraries'),
                     ('bundle-arrow-cpp', None,
                      'bundle the Arrow C++ libraries')] +
                    _build_ext.user_options)

    def initialize_options(self):
        _build_ext.initialize_options(self)
        self.extra_cmake_args = os.environ.get('PYARROW_CMAKE_OPTIONS', '')
        self.build_type = os.environ.get('PYARROW_BUILD_TYPE', 'debug').lower()
        self.boost_namespace = os.environ.get('PYARROW_BOOST_NAMESPACE')

        self.cmake_cxxflags = os.environ.get('PYARROW_CXXFLAGS', '')

        if sys.platform == 'win32':
            # Cannot do debug builds in Windows unless Python itself is a debug
            # build
            if not hasattr(sys, 'gettotalrefcount'):
                self.build_type = 'release'

        self.with_parquet = strtobool(
            os.environ.get('PYARROW_WITH_PARQUET', '0'))
        self.with_static_parquet = strtobool(
            os.environ.get('PYARROW_WITH_STATIC_PARQUET', '0'))
        self.with_static_boost = strtobool(
            os.environ.get('PYARROW_WITH_STATIC_BOOST', '0'))
        self.with_plasma = strtobool(
            os.environ.get('PYARROW_WITH_PLASMA', '0'))
        self.with_orc = strtobool(
            os.environ.get('PYARROW_WITH_ORC', '0'))
        self.bundle_arrow_cpp = strtobool(
            os.environ.get('PYARROW_BUNDLE_ARROW_CPP', '0'))
        # Default is True but this only is actually bundled when
        # we also bundle arrow-cpp.
        self.bundle_boost = strtobool(
            os.environ.get('PYARROW_BUNDLE_BOOST', '1'))

    CYTHON_MODULE_NAMES = [
        'lib',
        '_parquet',
        '_orc',
        'plasma']

    def _run_cmake(self):
        # The directory containing this setup.py
        source = osp.dirname(osp.abspath(__file__))

        # The staging directory for the module being built
        build_temp = pjoin(os.getcwd(), self.build_temp)
        build_lib = os.path.join(os.getcwd(), self.build_lib)
        saved_cwd = os.getcwd()

        if not os.path.isdir(self.build_temp):
            self.mkpath(self.build_temp)

        # Change to the build directory
        with changed_dir(self.build_temp):
            # Detect if we built elsewhere
            if os.path.isfile('CMakeCache.txt'):
                cachefile = open('CMakeCache.txt', 'r')
                cachedir = re.search('CMAKE_CACHEFILE_DIR:INTERNAL=(.*)',
                                     cachefile.read()).group(1)
                cachefile.close()
                if (cachedir != build_temp):
                    return

            static_lib_option = ''

            cmake_options = [
                '-DPYTHON_EXECUTABLE=%s' % sys.executable,
                static_lib_option,
            ]

            if self.with_parquet:
                cmake_options.append('-DPYARROW_BUILD_PARQUET=on')
            if self.with_static_parquet:
                cmake_options.append('-DPYARROW_PARQUET_USE_SHARED=off')
            if not self.with_static_boost:
                cmake_options.append('-DPYARROW_BOOST_USE_SHARED=on')
            else:
                cmake_options.append('-DPYARROW_BOOST_USE_SHARED=off')

            if self.with_plasma:
                cmake_options.append('-DPYARROW_BUILD_PLASMA=on')

            if self.with_orc:
                cmake_options.append('-DPYARROW_BUILD_ORC=on')

            if len(self.cmake_cxxflags) > 0:
                cmake_options.append('-DPYARROW_CXXFLAGS="{0}"'
                                     .format(self.cmake_cxxflags))

            if self.bundle_arrow_cpp:
                cmake_options.append('-DPYARROW_BUNDLE_ARROW_CPP=ON')
                cmake_options.append('-DPYARROW_BUNDLE_BOOST=ON')
                # ARROW-1090: work around CMake rough edges
                if 'ARROW_HOME' in os.environ and sys.platform != 'win32':
                    pkg_config = pjoin(os.environ['ARROW_HOME'], 'lib',
                                       'pkgconfig')
                    os.environ['PKG_CONFIG_PATH'] = pkg_config
                    del os.environ['ARROW_HOME']
            else:
                cmake_options.append('-DPYARROW_BUNDLE_BOOST=OFF')

            cmake_options.append('-DCMAKE_BUILD_TYPE={0}'
                                 .format(self.build_type.lower()))

            if self.boost_namespace is not None:
                cmake_options.append('-DBoost_NAMESPACE={}'
                                     .format(self.boost_namespace))

            extra_cmake_args = shlex.split(self.extra_cmake_args)
            if sys.platform != 'win32':
                cmake_command = (['cmake'] + extra_cmake_args +
                                 cmake_options + [source])

                print("-- Runnning cmake for pyarrow")
                self.spawn(cmake_command)
                print("-- Finished cmake for pyarrow")
                args = ['make']
                if os.environ.get('PYARROW_BUILD_VERBOSE', '0') == '1':
                    args.append('VERBOSE=1')

                if 'PYARROW_PARALLEL' in os.environ:
                    args.append('-j{0}'.format(os.environ['PYARROW_PARALLEL']))
                print("-- Running cmake --build for pyarrow")
                self.spawn(args)
                print("-- Finished cmake --build for pyarrow")
            else:
                cmake_generator = 'Visual Studio 14 2015 Win64'
                if not is_64_bit:
                    raise RuntimeError('Not supported on 32-bit Windows')

                # Generate the build files
                cmake_command = (['cmake'] + extra_cmake_args +
                                 cmake_options +
                                 [source, '-G', cmake_generator])
                if "-G" in self.extra_cmake_args:
                    cmake_command = cmake_command[:-2]

                print("-- Runnning cmake for pyarrow")
                self.spawn(cmake_command)
                print("-- Finished cmake for pyarrow")
                # Do the build
                print("-- Running cmake --build for pyarrow")
                self.spawn(['cmake', '--build', '.', '--config', self.build_type])
                print("-- Finished cmake --build for pyarrow")

            if self.inplace:
                # a bit hacky
                build_lib = saved_cwd

            # Move the libraries to the place expected by the Python
            # build

            try:
                os.makedirs(pjoin(build_lib, 'pyarrow'))
            except OSError:
                pass

            if sys.platform == 'win32':
                build_prefix = ''
            else:
                build_prefix = self.build_type

            if self.bundle_arrow_cpp:
                print(pjoin(build_lib, 'pyarrow'))
                move_shared_libs(build_prefix, build_lib, "arrow")
                move_shared_libs(build_prefix, build_lib, "arrow_python")
                if self.with_plasma:
                    move_shared_libs(build_prefix, build_lib, "plasma")
                if self.with_parquet and not self.with_static_parquet:
                    move_shared_libs(build_prefix, build_lib, "parquet")
                if not self.with_static_boost and self.bundle_boost:
                    move_shared_libs(
                        build_prefix, build_lib,
                        "{}_filesystem".format(self.boost_namespace))
                    move_shared_libs(
                        build_prefix, build_lib,
                        "{}_system".format(self.boost_namespace))
                    move_shared_libs(
                        build_prefix, build_lib,
                        "{}_regex".format(self.boost_namespace))

            print('Bundling includes: ' + pjoin(build_prefix, 'include'))
            if os.path.exists(pjoin(build_lib, 'pyarrow', 'include')):
                shutil.rmtree(pjoin(build_lib, 'pyarrow', 'include'))
            shutil.move(pjoin(build_prefix, 'include'),
                        pjoin(build_lib, 'pyarrow'))

            # Move the built C-extension to the place expected by the Python build
            self._found_names = []
            for name in self.CYTHON_MODULE_NAMES:
                built_path = self.get_ext_built(name)
                if not os.path.exists(built_path):
                    print(built_path)
                    if self._failure_permitted(name):
                        print('Cython module {0} failure permitted'.format(name))
                        continue
                    raise RuntimeError('pyarrow C-extension failed to build:',
                                       os.path.abspath(built_path))

                ext_path = pjoin(build_lib, self._get_cmake_ext_path(name))
                if os.path.exists(ext_path):
                    os.remove(ext_path)
                self.mkpath(os.path.dirname(ext_path))
                print('Moving built C-extension', built_path,
                      'to build path', ext_path)
                shutil.move(self.get_ext_built(name), ext_path)
                self._found_names.append(name)

                if os.path.exists(self.get_ext_built_api_header(name)):
                    shutil.move(self.get_ext_built_api_header(name),
                                pjoin(os.path.dirname(ext_path), name + '_api.h'))

            # Move the plasma store
            if self.with_plasma:
                build_py = self.get_finalized_command('build_py')
                source = os.path.join(self.build_type, "plasma_store")
                target = os.path.join(build_lib,
                                      build_py.get_package_dir('pyarrow'),
                                      "plasma_store")
                shutil.move(source, target)

    def _failure_permitted(self, name):
        if name == '_parquet' and not self.with_parquet:
            return True
        if name == 'plasma' and not self.with_plasma:
            return True
        if name == '_orc' and not self.with_orc:
            return True
        return False

    def _get_inplace_dir(self):
        pass

    def _get_cmake_ext_path(self, name):
        # Get the package directory from build_py
        build_py = self.get_finalized_command('build_py')
        package_dir = build_py.get_package_dir('pyarrow')
        # This is the name of the arrow C-extension
        suffix = sysconfig.get_config_var('EXT_SUFFIX')
        if suffix is None:
            suffix = sysconfig.get_config_var('SO')
        filename = name + suffix
        return pjoin(package_dir, filename)

    def get_ext_built_api_header(self, name):
        if sys.platform == 'win32':
            head, tail = os.path.split(name)
            return pjoin(head, tail + "_api.h")
        else:
            return pjoin(name + "_api.h")

    def get_ext_built(self, name):
        if sys.platform == 'win32':
            head, tail = os.path.split(name)
            suffix = sysconfig.get_config_var('SO')
            return pjoin(head, self.build_type, tail + suffix)
        else:
            suffix = sysconfig.get_config_var('SO')
            return pjoin(self.build_type, name + suffix)

    def get_names(self):
        return self._found_names

    def get_outputs(self):
        # Just the C extensions
        # regular_exts = _build_ext.get_outputs(self)
        return [self._get_cmake_ext_path(name)
                for name in self.get_names()]


def move_shared_libs(build_prefix, build_lib, lib_name):
    if sys.platform == 'win32':
        # Move all .dll and .lib files
        libs = glob.glob(pjoin(build_prefix, lib_name) + '*')

        for filename in libs:
            shutil.move(pjoin(build_prefix, filename),
                        pjoin(build_lib, 'pyarrow', filename))
    else:
        _move_shared_libs_unix(build_prefix, build_lib, lib_name)


def _move_shared_libs_unix(build_prefix, build_lib, lib_name):
    shared_library_prefix = 'lib'
    if sys.platform == 'darwin':
        shared_library_suffix = '.dylib'
    else:
        shared_library_suffix = '.so'

    lib_filename = (shared_library_prefix + lib_name +
                    shared_library_suffix)
    # Also copy libraries with ABI/SO version suffix
    if sys.platform == 'darwin':
        lib_pattern = (shared_library_prefix + lib_name +
                       ".*" + shared_library_suffix[1:])
        libs = glob.glob(pjoin(build_prefix, lib_pattern))
    else:
        libs = glob.glob(pjoin(build_prefix, lib_filename) + '*')

    if not libs:
        raise Exception('Could not find library:' + lib_filename +
                        ' in ' + build_prefix)

    # Longest suffix library should be copied, all others symlinked
    libs.sort(key=lambda s: -len(s))
    print(libs, libs[0])
    lib_filename = os.path.basename(libs[0])
    shutil.move(pjoin(build_prefix, lib_filename),
                pjoin(build_lib, 'pyarrow', lib_filename))
    for lib in libs[1:]:
        filename = os.path.basename(lib)
        link_name = pjoin(build_lib, 'pyarrow', filename)
        if not os.path.exists(link_name):
            os.symlink(lib_filename, link_name)


# In the case of a git-archive, we don't have any version information
# from the SCM to infer a version. The only source is the java/pom.xml.
#
# Note that this is only the case for git-archives. sdist tarballs have
# all relevant information (but not the Java sources).
if not os.path.exists('../.git') and os.path.exists('../java/pom.xml'):
    import xml.etree.ElementTree as ET
    tree = ET.parse('../java/pom.xml')
    version_tag = list(tree.getroot().findall(
        '{http://maven.apache.org/POM/4.0.0}version'))[0]
    os.environ["SETUPTOOLS_SCM_PRETEND_VERSION"] = version_tag.text.replace(
        "-SNAPSHOT", "a0")

long_description = """Apache Arrow is a columnar in-memory analytics layer
designed to accelerate big data. It houses a set of canonical in-memory
representations of flat and hierarchical data along with multiple
language-bindings for structure manipulation. It also provides IPC
and common algorithm implementations."""


class BinaryDistribution(Distribution):
    def has_ext_modules(foo):
        return True


install_requires = ['numpy >= 1.10', 'six >= 1.0.0']

if sys.version_info.major == 2:
    install_requires.append('futures')


def parse_version(root):
    from setuptools_scm import version_from_scm
    import setuptools_scm.git
    describe = setuptools_scm.git.DEFAULT_DESCRIBE + " --match 'apache-arrow-[0-9]*'"
    # Strip catchall from the commandline
    describe = describe.replace("--match *.*", "")
    version = setuptools_scm.git.parse(root, describe)
    if not version:
        return version_from_scm(root)
    else:
        return version


# Only include pytest-runner in setup_requires if we're invoking tests
if {'pytest', 'test', 'ptr'}.intersection(sys.argv):
    setup_requires = ['pytest-runner']
else:
    setup_requires = []

setup(
    name="pyarrow",
    packages=['pyarrow', 'pyarrow.tests'],
    zip_safe=False,
    package_data={'pyarrow': ['*.pxd', '*.pyx', 'includes/*.pxd']},
    include_package_data=True,
    distclass=BinaryDistribution,
    # Dummy extension to trigger build_ext
    ext_modules=[Extension('__dummy__', sources=[])],
    cmdclass={
        'clean': clean,
        'build_ext': build_ext
    },
    entry_points={
        'console_scripts': [
            'plasma_store = pyarrow:_plasma_store_entry_point'
        ]
    },
    use_scm_version={"root": "..", "relative_to": __file__, "parse": parse_version},
    setup_requires=['setuptools_scm', 'cython >= 0.23'] + setup_requires,
    install_requires=install_requires,
    tests_require=['pytest', 'pandas'],
    description="Python library for Apache Arrow",
    long_description=long_description,
    classifiers=[
        'License :: OSI Approved :: Apache Software License',
        'Programming Language :: Python :: 2.7',
        'Programming Language :: Python :: 3.4',
        'Programming Language :: Python :: 3.5',
        'Programming Language :: Python :: 3.6'
        ],
    license='Apache License, Version 2.0',
    maintainer="Apache Arrow Developers",
    maintainer_email="dev@arrow.apache.org",
    test_suite="pyarrow.tests",
    url="https://arrow.apache.org/"
)
Highlighted

Re: Pyarrow-0.9.0 installation

Cloudera Employee

The script looks good, Can you check the permission for this script and provide 755 for the same?

Also, verify the ownership.