Our Community is getting an upgrade! To get everything ready for the relaunch, we’ll be placing the site in read-only mode starting September 21st.
We really appreciate your understanding while we get things set up behind the scenes. Catch up on all the exciting details about the move here.
Need help or have questions? Drop us a line at [email protected]
Created on
11-22-2016
03:28 PM
- last edited on
04-21-2026
06:48 AM
by
GrazittiAPI
I run this command -
hadoop jar /usr/lib/hue/apps/oozie/examples/lib/hadoop-examples.jar wordcount shakespeare wordcount-output
[cloudera@quickstart ~]$ hadoop jar /usr/lib/hue/apps/oozie/examples/lib/hadoop-examples.jar wordcount shakespeare wordcount-output 16/11/22 15:10:43 INFO client.RMProxy: Connecting to ResourceManager at quickstart.cloudera/192.168.8.129:8032 16/11/22 15:11:22 INFO input.FileInputFormat: Total input paths to process : 4 16/11/22 15:11:23 INFO mapreduce.JobSubmitter: number of splits:4 16/11/22 15:11:28 INFO mapreduce.JobSubmitter: Submitting tokens for job: job_1479831488614_0002 16/11/22 15:11:36 INFO impl.YarnClientImpl: Submitted application application_1479831488614_0002 16/11/22 15:11:37 INFO mapreduce.Job: The url to track the job: http://quickstart.cloudera:8088/proxy/application_1479831488614_0002/ 16/11/22 15:11:37 INFO mapreduce.Job: Running job: job_1479831488614_0002
I tried it a few times before and already had the same 5 jobs pending. But then I "killed" the jobs. This time I only have 2 jobs pending.
What am I doing wrong?
Created 12-02-2016 03:04 AM
Can you check your /etc/hadoop/conf/yarn-site.xml and ensure the following two parameters are set:
<property>
<name>yarn.nodemanager.aux-services</name>
<value>mapreduce_shuffle</value>
</property>
<property>
<name>yarn.nodemanager.aux-services.mapreduce_shuffle.class</name>
<value>org.apache.hadoop.mapred.ShuffleHandler</value>
</property>
Created on 11-30-2016 03:29 PM - edited 11-30-2016 03:36 PM
Thanks @sodonnell!
The permissions problem had been solved, but now I get a new error -
org.apache.hadoop.yarn.exceptions.InvalidAuxServiceException: The auxService:mapreduce_shuffle does not exist
part of the error (I think it's too long to post here):
16/11/30 14:36:26 INFO client.RMProxy: Connecting to ResourceManager at quickstart.cloudera/192.168.8.129:8032 16/11/30 14:36:35 INFO input.FileInputFormat: Total input paths to process : 4 16/11/30 14:36:37 INFO mapreduce.JobSubmitter: number of splits:4 16/11/30 14:36:39 INFO mapreduce.JobSubmitter: Submitting tokens for job: job_1480545345601_0001 16/11/30 14:36:44 INFO impl.YarnClientImpl: Submitted application application_1480545345601_0001 16/11/30 14:36:45 INFO mapreduce.Job: The url to track the job: http://quickstart.cloudera:8088/proxy/application_1480545345601_0001/ 16/11/30 14:36:45 INFO mapreduce.Job: Running job: job_1480545345601_0001 16/11/30 14:38:02 INFO mapreduce.Job: Job job_1480545345601_0001 running in uber mode : false 16/11/30 14:38:02 INFO mapreduce.Job: map 0% reduce 0% 16/11/30 14:38:08 INFO mapreduce.Job: Task Id : attempt_1480545345601_0001_m_000002_0, Status : FAILED Container launch failed for container_1480545345601_0001_01_000004 : org.apache.hadoop.yarn.exceptions.InvalidAuxServiceException: The auxService:mapreduce_shuffle does not exist at sun.reflect.NativeConstructorAccessorImpl.newInstance0(Native Method) at sun.reflect.NativeConstructorAccessorImpl.newInstance(NativeConstructorAccessorImpl.java:57) at sun.reflect.DelegatingConstructorAccessorImpl.newInstance(DelegatingConstructorAccessorImpl.java:45) at java.lang.reflect.Constructor.newInstance(Constructor.java:526) at org.apache.hadoop.yarn.api.records.impl.pb.SerializedExceptionPBImpl.instantiateException(SerializedExceptionPBImpl.java:168) at org.apache.hadoop.yarn.api.records.impl.pb.SerializedExceptionPBImpl.deSerialize(SerializedExceptionPBImpl.java:106) at org.apache.hadoop.mapreduce.v2.app.launcher.ContainerLauncherImpl$Container.launch(ContainerLauncherImpl.java:159) at org.apache.hadoop.mapreduce.v2.app.launcher.ContainerLauncherImpl$EventProcessor.run(ContainerLauncherImpl.java:379) at java.util.concurrent.ThreadPoolExecutor.runWorker(ThreadPoolExecutor.java:1145) at java.util.concurrent.ThreadPoolExecutor$Worker.run(ThreadPoolExecutor.java:615) at java.lang.Thread.run(Thread.java:745)
16/11/30 14:38:19 INFO mapreduce.Job: map 100% reduce 100% 16/11/30 14:38:21 INFO mapreduce.Job: Job job_1480545345601_0001 failed with state FAILED due to: Task failed task_1480545345601_0001_m_000002 Job failed as tasks failed. failedMaps:1 failedReduces:0 16/11/30 14:38:22 INFO mapreduce.Job: Counters: 11 Job Counters Failed map tasks=13 Killed map tasks=3 Killed reduce tasks=1 Launched map tasks=13 Other local map tasks=9 Data-local map tasks=4 Total time spent by all maps in occupied slots (ms)=25088 Total time spent by all reduces in occupied slots (ms)=0 Total time spent by all map tasks (ms)=49 Total vcore-seconds taken by all map tasks=49 Total megabyte-seconds taken by all map tasks=25088
Created 11-30-2016 03:32 PM
The full error:
16/11/30 14:36:26 INFO client.RMProxy: Connecting to ResourceManager at quickstart.cloudera/192.168.8.129:8032
16/11/30 14:36:35 INFO input.FileInputFormat: Total input paths to process : 4
16/11/30 14:36:37 INFO mapreduce.JobSubmitter: number of splits:4
16/11/30 14:36:39 INFO mapreduce.JobSubmitter: Submitting tokens for job: job_1480545345601_0001
16/11/30 14:36:44 INFO impl.YarnClientImpl: Submitted application application_1480545345601_0001
16/11/30 14:36:45 INFO mapreduce.Job: The url to track the job: http://quickstart.cloudera:8088/proxy/application_1480545345601_0001/
16/11/30 14:36:45 INFO mapreduce.Job: Running job: job_1480545345601_0001
16/11/30 14:38:02 INFO mapreduce.Job: Job job_1480545345601_0001 running in uber mode : false
16/11/30 14:38:02 INFO mapreduce.Job: map 0% reduce 0%
16/11/30 14:38:08 INFO mapreduce.Job: Task Id : attempt_1480545345601_0001_m_000002_0, Status : FAILED
Container launch failed for container_1480545345601_0001_01_000004 : org.apache.hadoop.yarn.exceptions.InvalidAuxServiceException: The auxService:mapreduce_shuffle does not exist
at sun.reflect.NativeConstructorAccessorImpl.newInstance0(Native Method)
at sun.reflect.NativeConstructorAccessorImpl.newInstance(NativeConstructorAccessorImpl.java:57)
at sun.reflect.DelegatingConstructorAccessorImpl.newInstance(DelegatingConstructorAccessorImpl.java:45)
at java.lang.reflect.Constructor.newInstance(Constructor.java:526)
at org.apache.hadoop.yarn.api.records.impl.pb.SerializedExceptionPBImpl.instantiateException(SerializedExceptionPBImpl.java:168)
at org.apache.hadoop.yarn.api.records.impl.pb.SerializedExceptionPBImpl.deSerialize(SerializedExceptionPBImpl.java:106)
at org.apache.hadoop.mapreduce.v2.app.launcher.ContainerLauncherImpl$Container.launch(ContainerLauncherImpl.java:159)
at org.apache.hadoop.mapreduce.v2.app.launcher.ContainerLauncherImpl$EventProcessor.run(ContainerLauncherImpl.java:379)
at java.util.concurrent.ThreadPoolExecutor.runWorker(ThreadPoolExecutor.java:1145)
at java.util.concurrent.ThreadPoolExecutor$Worker.run(ThreadPoolExecutor.java:615)
at java.lang.Thread.run(Thread.java:745)
16/11/30 14:38:09 INFO mapreduce.Job: Task Id : attempt_1480545345601_0001_m_000000_0, Status : FAILED
Container launch failed for container_1480545345601_0001_01_000002 : org.apache.hadoop.yarn.exceptions.InvalidAuxServiceException: The auxService:mapreduce_shuffle does not exist
at sun.reflect.NativeConstructorAccessorImpl.newInstance0(Native Method)
at sun.reflect.NativeConstructorAccessorImpl.newInstance(NativeConstructorAccessorImpl.java:57)
at sun.reflect.DelegatingConstructorAccessorImpl.newInstance(DelegatingConstructorAccessorImpl.java:45)
at java.lang.reflect.Constructor.newInstance(Constructor.java:526)
at org.apache.hadoop.yarn.api.records.impl.pb.SerializedExceptionPBImpl.instantiateException(SerializedExceptionPBImpl.java:168)
at org.apache.hadoop.yarn.api.records.impl.pb.SerializedExceptionPBImpl.deSerialize(SerializedExceptionPBImpl.java:106)
at org.apache.hadoop.mapreduce.v2.app.launcher.ContainerLauncherImpl$Container.launch(ContainerLauncherImpl.java:159)
at org.apache.hadoop.mapreduce.v2.app.launcher.ContainerLauncherImpl$EventProcessor.run(ContainerLauncherImpl.java:379)
at java.util.concurrent.ThreadPoolExecutor.runWorker(ThreadPoolExecutor.java:1145)
at java.util.concurrent.ThreadPoolExecutor$Worker.run(ThreadPoolExecutor.java:615)
at java.lang.Thread.run(Thread.java:745)
16/11/30 14:38:09 INFO mapreduce.Job: Task Id : attempt_1480545345601_0001_m_000001_0, Status : FAILED
Container launch failed for container_1480545345601_0001_01_000003 : org.apache.hadoop.yarn.exceptions.InvalidAuxServiceException: The auxService:mapreduce_shuffle does not exist
at sun.reflect.NativeConstructorAccessorImpl.newInstance0(Native Method)
at sun.reflect.NativeConstructorAccessorImpl.newInstance(NativeConstructorAccessorImpl.java:57)
at sun.reflect.DelegatingConstructorAccessorImpl.newInstance(DelegatingConstructorAccessorImpl.java:45)
at java.lang.reflect.Constructor.newInstance(Constructor.java:526)
at org.apache.hadoop.yarn.api.records.impl.pb.SerializedExceptionPBImpl.instantiateException(SerializedExceptionPBImpl.java:168)
at org.apache.hadoop.yarn.api.records.impl.pb.SerializedExceptionPBImpl.deSerialize(SerializedExceptionPBImpl.java:106)
at org.apache.hadoop.mapreduce.v2.app.launcher.ContainerLauncherImpl$Container.launch(ContainerLauncherImpl.java:159)
at org.apache.hadoop.mapreduce.v2.app.launcher.ContainerLauncherImpl$EventProcessor.run(ContainerLauncherImpl.java:379)
at java.util.concurrent.ThreadPoolExecutor.runWorker(ThreadPoolExecutor.java:1145)
at java.util.concurrent.ThreadPoolExecutor$Worker.run(ThreadPoolExecutor.java:615)
at java.lang.Thread.run(Thread.java:745)
16/11/30 14:38:09 INFO mapreduce.Job: Task Id : attempt_1480545345601_0001_m_000003_0, Status : FAILED
Container launch failed for container_1480545345601_0001_01_000005 : org.apache.hadoop.yarn.exceptions.InvalidAuxServiceException: The auxService:mapreduce_shuffle does not exist
at sun.reflect.NativeConstructorAccessorImpl.newInstance0(Native Method)
at sun.reflect.NativeConstructorAccessorImpl.newInstance(NativeConstructorAccessorImpl.java:57)
at sun.reflect.DelegatingConstructorAccessorImpl.newInstance(DelegatingConstructorAccessorImpl.java:45)
at java.lang.reflect.Constructor.newInstance(Constructor.java:526)
at org.apache.hadoop.yarn.api.records.impl.pb.SerializedExceptionPBImpl.instantiateException(SerializedExceptionPBImpl.java:168)
at org.apache.hadoop.yarn.api.records.impl.pb.SerializedExceptionPBImpl.deSerialize(SerializedExceptionPBImpl.java:106)
at org.apache.hadoop.mapreduce.v2.app.launcher.ContainerLauncherImpl$Container.launch(ContainerLauncherImpl.java:159)
at org.apache.hadoop.mapreduce.v2.app.launcher.ContainerLauncherImpl$EventProcessor.run(ContainerLauncherImpl.java:379)
at java.util.concurrent.ThreadPoolExecutor.runWorker(ThreadPoolExecutor.java:1145)
at java.util.concurrent.ThreadPoolExecutor$Worker.run(ThreadPoolExecutor.java:615)
at java.lang.Thread.run(Thread.java:745)
16/11/30 14:38:10 INFO mapreduce.Job: Task Id : attempt_1480545345601_0001_m_000002_1, Status : FAILED
Container launch failed for container_1480545345601_0001_01_000007 : org.apache.hadoop.yarn.exceptions.InvalidAuxServiceException: The auxService:mapreduce_shuffle does not exist
at sun.reflect.NativeConstructorAccessorImpl.newInstance0(Native Method)
at sun.reflect.NativeConstructorAccessorImpl.newInstance(NativeConstructorAccessorImpl.java:57)
at sun.reflect.DelegatingConstructorAccessorImpl.newInstance(DelegatingConstructorAccessorImpl.java:45)
at java.lang.reflect.Constructor.newInstance(Constructor.java:526)
at org.apache.hadoop.yarn.api.records.impl.pb.SerializedExceptionPBImpl.instantiateException(SerializedExceptionPBImpl.java:168)
at org.apache.hadoop.yarn.api.records.impl.pb.SerializedExceptionPBImpl.deSerialize(SerializedExceptionPBImpl.java:106)
at org.apache.hadoop.mapreduce.v2.app.launcher.ContainerLauncherImpl$Container.launch(ContainerLauncherImpl.java:159)
at org.apache.hadoop.mapreduce.v2.app.launcher.ContainerLauncherImpl$EventProcessor.run(ContainerLauncherImpl.java:379)
at java.util.concurrent.ThreadPoolExecutor.runWorker(ThreadPoolExecutor.java:1145)
at java.util.concurrent.ThreadPoolExecutor$Worker.run(ThreadPoolExecutor.java:615)
at java.lang.Thread.run(Thread.java:745)
16/11/30 14:38:11 INFO mapreduce.Job: Task Id : attempt_1480545345601_0001_m_000000_1, Status : FAILED
Container launch failed for container_1480545345601_0001_01_000008 : org.apache.hadoop.yarn.exceptions.InvalidAuxServiceException: The auxService:mapreduce_shuffle does not exist
at sun.reflect.NativeConstructorAccessorImpl.newInstance0(Native Method)
at sun.reflect.NativeConstructorAccessorImpl.newInstance(NativeConstructorAccessorImpl.java:57)
at sun.reflect.DelegatingConstructorAccessorImpl.newInstance(DelegatingConstructorAccessorImpl.java:45)
at java.lang.reflect.Constructor.newInstance(Constructor.java:526)
at org.apache.hadoop.yarn.api.records.impl.pb.SerializedExceptionPBImpl.instantiateException(SerializedExceptionPBImpl.java:168)
at org.apache.hadoop.yarn.api.records.impl.pb.SerializedExceptionPBImpl.deSerialize(SerializedExceptionPBImpl.java:106)
at org.apache.hadoop.mapreduce.v2.app.launcher.ContainerLauncherImpl$Container.launch(ContainerLauncherImpl.java:159)
at org.apache.hadoop.mapreduce.v2.app.launcher.ContainerLauncherImpl$EventProcessor.run(ContainerLauncherImpl.java:379)
at java.util.concurrent.ThreadPoolExecutor.runWorker(ThreadPoolExecutor.java:1145)
at java.util.concurrent.ThreadPoolExecutor$Worker.run(ThreadPoolExecutor.java:615)
at java.lang.Thread.run(Thread.java:745)
16/11/30 14:38:12 INFO mapreduce.Job: Task Id : attempt_1480545345601_0001_m_000001_1, Status : FAILED
Container launch failed for container_1480545345601_0001_01_000009 : org.apache.hadoop.yarn.exceptions.InvalidAuxServiceException: The auxService:mapreduce_shuffle does not exist
at sun.reflect.NativeConstructorAccessorImpl.newInstance0(Native Method)
at sun.reflect.NativeConstructorAccessorImpl.newInstance(NativeConstructorAccessorImpl.java:57)
at sun.reflect.DelegatingConstructorAccessorImpl.newInstance(DelegatingConstructorAccessorImpl.java:45)
at java.lang.reflect.Constructor.newInstance(Constructor.java:526)
at org.apache.hadoop.yarn.api.records.impl.pb.SerializedExceptionPBImpl.instantiateException(SerializedExceptionPBImpl.java:168)
at org.apache.hadoop.yarn.api.records.impl.pb.SerializedExceptionPBImpl.deSerialize(SerializedExceptionPBImpl.java:106)
at org.apache.hadoop.mapreduce.v2.app.launcher.ContainerLauncherImpl$Container.launch(ContainerLauncherImpl.java:159)
at org.apache.hadoop.mapreduce.v2.app.launcher.ContainerLauncherImpl$EventProcessor.run(ContainerLauncherImpl.java:379)
at java.util.concurrent.ThreadPoolExecutor.runWorker(ThreadPoolExecutor.java:1145)
at java.util.concurrent.ThreadPoolExecutor$Worker.run(ThreadPoolExecutor.java:615)
at java.lang.Thread.run(Thread.java:745)
16/11/30 14:38:13 INFO mapreduce.Job: Task Id : attempt_1480545345601_0001_m_000003_1, Status : FAILED
Container launch failed for container_1480545345601_0001_01_000010 : org.apache.hadoop.yarn.exceptions.InvalidAuxServiceException: The auxService:mapreduce_shuffle does not exist
at sun.reflect.NativeConstructorAccessorImpl.newInstance0(Native Method)
at sun.reflect.NativeConstructorAccessorImpl.newInstance(NativeConstructorAccessorImpl.java:57)
at sun.reflect.DelegatingConstructorAccessorImpl.newInstance(DelegatingConstructorAccessorImpl.java:45)
at java.lang.reflect.Constructor.newInstance(Constructor.java:526)
at org.apache.hadoop.yarn.api.records.impl.pb.SerializedExceptionPBImpl.instantiateException(SerializedExceptionPBImpl.java:168)
at org.apache.hadoop.yarn.api.records.impl.pb.SerializedExceptionPBImpl.deSerialize(SerializedExceptionPBImpl.java:106)
at org.apache.hadoop.mapreduce.v2.app.launcher.ContainerLauncherImpl$Container.launch(ContainerLauncherImpl.java:159)
at org.apache.hadoop.mapreduce.v2.app.launcher.ContainerLauncherImpl$EventProcessor.run(ContainerLauncherImpl.java:379)
at java.util.concurrent.ThreadPoolExecutor.runWorker(ThreadPoolExecutor.java:1145)
at java.util.concurrent.ThreadPoolExecutor$Worker.run(ThreadPoolExecutor.java:615)
at java.lang.Thread.run(Thread.java:745)
16/11/30 14:38:14 INFO mapreduce.Job: Task Id : attempt_1480545345601_0001_m_000002_2, Status : FAILED
Container launch failed for container_1480545345601_0001_01_000011 : org.apache.hadoop.yarn.exceptions.InvalidAuxServiceException: The auxService:mapreduce_shuffle does not exist
at sun.reflect.NativeConstructorAccessorImpl.newInstance0(Native Method)
at sun.reflect.NativeConstructorAccessorImpl.newInstance(NativeConstructorAccessorImpl.java:57)
at sun.reflect.DelegatingConstructorAccessorImpl.newInstance(DelegatingConstructorAccessorImpl.java:45)
at java.lang.reflect.Constructor.newInstance(Constructor.java:526)
at org.apache.hadoop.yarn.api.records.impl.pb.SerializedExceptionPBImpl.instantiateException(SerializedExceptionPBImpl.java:168)
at org.apache.hadoop.yarn.api.records.impl.pb.SerializedExceptionPBImpl.deSerialize(SerializedExceptionPBImpl.java:106)
at org.apache.hadoop.mapreduce.v2.app.launcher.ContainerLauncherImpl$Container.launch(ContainerLauncherImpl.java:159)
at org.apache.hadoop.mapreduce.v2.app.launcher.ContainerLauncherImpl$EventProcessor.run(ContainerLauncherImpl.java:379)
at java.util.concurrent.ThreadPoolExecutor.runWorker(ThreadPoolExecutor.java:1145)
at java.util.concurrent.ThreadPoolExecutor$Worker.run(ThreadPoolExecutor.java:615)
at java.lang.Thread.run(Thread.java:745)
16/11/30 14:38:15 INFO mapreduce.Job: Task Id : attempt_1480545345601_0001_m_000000_2, Status : FAILED
Container launch failed for container_1480545345601_0001_01_000012 : org.apache.hadoop.yarn.exceptions.InvalidAuxServiceException: The auxService:mapreduce_shuffle does not exist
at sun.reflect.NativeConstructorAccessorImpl.newInstance0(Native Method)
at sun.reflect.NativeConstructorAccessorImpl.newInstance(NativeConstructorAccessorImpl.java:57)
at sun.reflect.DelegatingConstructorAccessorImpl.newInstance(DelegatingConstructorAccessorImpl.java:45)
at java.lang.reflect.Constructor.newInstance(Constructor.java:526)
at org.apache.hadoop.yarn.api.records.impl.pb.SerializedExceptionPBImpl.instantiateException(SerializedExceptionPBImpl.java:168)
at org.apache.hadoop.yarn.api.records.impl.pb.SerializedExceptionPBImpl.deSerialize(SerializedExceptionPBImpl.java:106)
at org.apache.hadoop.mapreduce.v2.app.launcher.ContainerLauncherImpl$Container.launch(ContainerLauncherImpl.java:159)
at org.apache.hadoop.mapreduce.v2.app.launcher.ContainerLauncherImpl$EventProcessor.run(ContainerLauncherImpl.java:379)
at java.util.concurrent.ThreadPoolExecutor.runWorker(ThreadPoolExecutor.java:1145)
at java.util.concurrent.ThreadPoolExecutor$Worker.run(ThreadPoolExecutor.java:615)
at java.lang.Thread.run(Thread.java:745)
16/11/30 14:38:16 INFO mapreduce.Job: Task Id : attempt_1480545345601_0001_m_000001_2, Status : FAILED
Container launch failed for container_1480545345601_0001_01_000013 : org.apache.hadoop.yarn.exceptions.InvalidAuxServiceException: The auxService:mapreduce_shuffle does not exist
at sun.reflect.NativeConstructorAccessorImpl.newInstance0(Native Method)
at sun.reflect.NativeConstructorAccessorImpl.newInstance(NativeConstructorAccessorImpl.java:57)
at sun.reflect.DelegatingConstructorAccessorImpl.newInstance(DelegatingConstructorAccessorImpl.java:45)
at java.lang.reflect.Constructor.newInstance(Constructor.java:526)
at org.apache.hadoop.yarn.api.records.impl.pb.SerializedExceptionPBImpl.instantiateException(SerializedExceptionPBImpl.java:168)
at org.apache.hadoop.yarn.api.records.impl.pb.SerializedExceptionPBImpl.deSerialize(SerializedExceptionPBImpl.java:106)
at org.apache.hadoop.mapreduce.v2.app.launcher.ContainerLauncherImpl$Container.launch(ContainerLauncherImpl.java:159)
at org.apache.hadoop.mapreduce.v2.app.launcher.ContainerLauncherImpl$EventProcessor.run(ContainerLauncherImpl.java:379)
at java.util.concurrent.ThreadPoolExecutor.runWorker(ThreadPoolExecutor.java:1145)
at java.util.concurrent.ThreadPoolExecutor$Worker.run(ThreadPoolExecutor.java:615)
at java.lang.Thread.run(Thread.java:745)
16/11/30 14:38:17 INFO mapreduce.Job: Task Id : attempt_1480545345601_0001_m_000003_2, Status : FAILED
Container launch failed for container_1480545345601_0001_01_000014 : org.apache.hadoop.yarn.exceptions.InvalidAuxServiceException: The auxService:mapreduce_shuffle does not exist
at sun.reflect.NativeConstructorAccessorImpl.newInstance0(Native Method)
at sun.reflect.NativeConstructorAccessorImpl.newInstance(NativeConstructorAccessorImpl.java:57)
at sun.reflect.DelegatingConstructorAccessorImpl.newInstance(DelegatingConstructorAccessorImpl.java:45)
at java.lang.reflect.Constructor.newInstance(Constructor.java:526)
at org.apache.hadoop.yarn.api.records.impl.pb.SerializedExceptionPBImpl.instantiateException(SerializedExceptionPBImpl.java:168)
at org.apache.hadoop.yarn.api.records.impl.pb.SerializedExceptionPBImpl.deSerialize(SerializedExceptionPBImpl.java:106)
at org.apache.hadoop.mapreduce.v2.app.launcher.ContainerLauncherImpl$Container.launch(ContainerLauncherImpl.java:159)
at org.apache.hadoop.mapreduce.v2.app.launcher.ContainerLauncherImpl$EventProcessor.run(ContainerLauncherImpl.java:379)
at java.util.concurrent.ThreadPoolExecutor.runWorker(ThreadPoolExecutor.java:1145)
at java.util.concurrent.ThreadPoolExecutor$Worker.run(ThreadPoolExecutor.java:615)
at java.lang.Thread.run(Thread.java:745)
16/11/30 14:38:19 INFO mapreduce.Job: map 100% reduce 100%
16/11/30 14:38:21 INFO mapreduce.Job: Job job_1480545345601_0001 failed with state FAILED due to: Task failed task_1480545345601_0001_m_000002
Job failed as tasks failed. failedMaps:1 failedReduces:0
16/11/30 14:38:22 INFO mapreduce.Job: Counters: 11
Job Counters
Failed map tasks=13
Killed map tasks=3
Killed reduce tasks=1
Launched map tasks=13
Other local map tasks=9
Data-local map tasks=4
Total time spent by all maps in occupied slots (ms)=25088
Total time spent by all reduces in occupied slots (ms)=0
Total time spent by all map tasks (ms)=49
Total vcore-seconds taken by all map tasks=49
Total megabyte-seconds taken by all map tasks=25088
Created 12-02-2016 03:04 AM
Can you check your /etc/hadoop/conf/yarn-site.xml and ensure the following two parameters are set:
<property>
<name>yarn.nodemanager.aux-services</name>
<value>mapreduce_shuffle</value>
</property>
<property>
<name>yarn.nodemanager.aux-services.mapreduce_shuffle.class</name>
<value>org.apache.hadoop.mapred.ShuffleHandler</value>
</property>
Created 12-02-2016 06:41 PM
Thank you very much @sodonnell!
Created on 10-22-2017 05:01 PM - edited 10-22-2017 05:14 PM
Hey, thanks for the post.
Adding these two services should fix the auxillary service exception issue. Dont forget to restart the yarn services.
Thanks!
Created 10-16-2018 09:37 AM
Hi Guys,
I am facing similar issue. I have a new installation of Cloudera and i am trying to run a simple Map reduce Pi Example. The job gets stuck at the map 0% and reduce 0% step as shown below.
test@spark-1 ~]$ sudo -u hdfs hadoop jar /data/cloudera/parcels/CDH/lib/hadoop-mapreduce/hadoop-mapreduce-examples.jar pi 10 100 Number of Maps = 10 Samples per Map = 100 Wrote input for Map #0 Wrote input for Map #1 Wrote input for Map #2 Wrote input for Map #3 Wrote input for Map #4 Wrote input for Map #5 Wrote input for Map #6 Wrote input for Map #7 Wrote input for Map #8 Wrote input for Map #9 Starting Job 18/10/16 12:33:25 INFO input.FileInputFormat: Total input paths to process : 10 18/10/16 12:33:26 INFO mapreduce.JobSubmitter: number of splits:10 18/10/16 12:33:26 INFO mapreduce.JobSubmitter: Submitting tokens for job: job_1539705370715_0002 18/10/16 12:33:26 INFO impl.YarnClientImpl: Submitted application application_1539705370715_0002 18/10/16 12:33:26 INFO mapreduce.Job: The url to track the job: http://spark-4:8088/proxy/application_1539705370715_0002/ 18/10/16 12:33:26 INFO mapreduce.Job: Running job: job_1539705370715_0002 18/10/16 12:33:31 INFO mapreduce.Job: Job job_1539705370715_0002 running in uber mode : false 18/10/16 12:33:31 INFO mapreduce.Job: map 0% reduce 0%
I made multiple config changes, but cannot find a solution for this. The only error i could trace was in the nodemanager log file as below :
ERROR org.apache.hadoop.yarn.server.nodemanager.NodeManager: RECEIVED SIGNAL 15: SIGTERM
I tried checking various properties discussed in this thread, but i still have that issue. Can someone please help in solving this issue? Please let me know what all details i can provide.