Support Questions
Find answers, ask questions, and share your expertise
Announcements
Alert: Welcome to the Unified Cloudera Community. Former HCC members be sure to read and learn how to activate your account here.

(Apache Metron) Error in Building Metron

(Apache Metron) Error in Building Metron

New Contributor

Hi, I have a problem in building metron.

This is my platform-info.sh


Metron 0.7.1

--

* master

--

commit 54aa46ee44a329504559f417790324c175f5af6a

Author: mmiklavc <michael.miklavcic@gmail.com>

Date: Wed Apr 10 13:04:03 2019 -0600


METRON-2066 Documentation and logging corrections (mmiklavc) closes apache/metron#1378

--

metron-deployment/development/centos6/Vagrantfile | 1 +

1 file changed, 1 insertion(+)

--

ansible 2.4.0.0

config file = None

configured module search path = [u'/root/.ansible/plugins/modules', u'/usr/share/ansible/plugins/modules']

ansible python module location = /usr/local/lib/python2.7/dist-packages/ansible

executable location = /usr/local/bin/ansible

python version = 2.7.12 (default, Nov 12 2018, 14:36:49) [GCC 5.4.0 20160609]

--

Vagrant 2.2.4

--

vagrant-hostmanager (1.8.9, global)

--

Python 2.7.12

--

Apache Maven 3.3.9

Maven home: /usr/share/maven

Java version: 1.8.0_201, vendor: Oracle Corporation

Java home: /usr/lib/jvm/java-8-oracle/jre

Default locale: en_US, platform encoding: UTF-8

OS name: "linux", version: "4.4.0-131-generic", arch: "amd64", family: "unix"

--

Docker version 18.09.5, build e8ff056

--

node

v10.15.3

--

npm

6.4.1

--

g++ (Ubuntu 5.4.0-6ubuntu1~16.04.11) 5.4.0 20160609

Copyright (C) 2015 Free Software Foundation, Inc.

This is free software; see the source for copying conditions. There is NO

warranty; not even for MERCHANTABILITY or FITNESS FOR A PARTICULAR PURPOSE.


--

Compiler is C++11 compliant

--

Linux metron-desktop 4.4.0-131-generic #157-Ubuntu SMP Thu Jul 12 15:51:36 UTC 2018 x86_64 x86_64 x86_64 GNU/Linux

--

Total System Memory = 7951.5 MB

Processor Model: Intel(R) Xeon(R) CPU E3-1220 V2 @ 3.10GHz

Processor Speed: 2113.207 MHz

Processor Speed: 2283.343 MHz

Processor Speed: 2366.171 MHz

Processor Speed: 2221.949 MHz

Total Physical Processors: 4

Total cores: 16

Disk information:

/dev/mapper/metron--desktop--vg-root 1.8T 10G 1.7T 1% /

/dev/sda2 721M 70M 615M 11% /boot

/dev/sda1 511M 4.7M 507M 1% /boot/efi

This CPU appears to support virtualization


And here is my error:

failed: [node1 -> localhost] (item=mvn package -DskipTests -T 2C -P HDP-2.5.0.0,mpack) => {

"changed": true,

"cmd": "mvn package -DskipTests -T 2C -P HDP-2.5.0.0,mpack",

"delta": "0:00:27.666873",

"end": "2019-04-12 12:06:24.247143",

"failed": true,

"invocation": {

"module_args": {

"_raw_params": "mvn package -DskipTests -T 2C -P HDP-2.5.0.0,mpack",

"_uses_shell": true,

"chdir": "/root/ansible_virtualenvs/2.4.0/metron/metron-deployment/ansible/playbooks/../../..",

"creates": null,

"executable": null,

"removes": null,

"stdin": null,

"warn": true

}

},

"item": "mvn package -DskipTests -T 2C -P HDP-2.5.0.0,mpack",

"msg": "non-zero return code",

"rc": 1,

"start": "2019-04-12 12:05:56.580270",

"stderr": "/root/ansible_virtualenvs/2.4.0/metron/metron-platform/metron-zookeeper/src/main/java/org/apache/metron/zookeeper/SimpleEventListener.java:114: warning: [DefaultCharset] Implicit use of the platform default charset, which can result in e.g. non-ASCII characters being silently replaced with '?' in many environments\n LOG.debug(\"Type: {}, Path: {}, Data: {}\", event.getType(), (path == null?\"\":path) , (data == null?\"\":new String(data)));\n ^\n (see http://errorprone.info/bugpattern/DefaultCharset)\n Did you mean 'LOG.debug(\"Type: {}, Path: {}, Data: {}\", event.getType(), (path == null?\"\":path) , (data == null?\"\":new String(data, UTF_8)));' or 'LOG.debug(\"Type: {}, Path: {}, Data: {}\", event.getType(), (path == null?\"\":path) , (data == null?\"\":new String(data, Charset.defaultCharset())));'?\n1 warning\nwarning: No SupportedSourceVersion annotation found on org.adrianwalker.multilinestring.MultilineProcessor, returning RELEASE_6.\nwarning: Supported source version 'RELEASE_6' from annotation processor 'org.adrianwalker.multilinestring.MultilineProcessor' less than -source '1.8'\n2 warnings\nwarning: No SupportedSourceVersion annotation found on org.adrianwalker.multilinestring.MultilineProcessor, returning RELEASE_6.\nwarning: Supported source version 'RELEASE_6' from annotation processor 'org.adrianwalker.multilinestring.MultilineProcessor' less than -source '1.8'\n/root/ansible_virtualenvs/2.4.0/metron/metron-platform/metron-test-utilities/src/main/java/org/apache/metron/test/filereaders/FileReader.java:42: warning: [DefaultCharset] Implicit use of the platform default charset, which can result in e.g. non-ASCII characters being silently replaced with '?' in many environments\n\t\tBufferedReader br = new BufferedReader(new InputStreamReader(in));\n\t\t ^\n (see http://errorprone.info/bugpattern/DefaultCharset)\n Did you mean 'BufferedReader br = new BufferedReader(new InputStreamReader(in, UTF_8));' or 'BufferedReader br = new BufferedReader(new InputStreamReader(in, Charset.defaultCharset()));'?\n/root/ansible_virtualenvs/2.4.0/metron/metron-platform/metron-test-utilities/src/main/java/org/apache/metron/test/bolt/BaseBoltTest.java:87: warning: [unchecked] unchecked method invocation: method copyOf in class ImmutableSet is applied to given types\n ImmutableSet keys = ImmutableSet.copyOf(message.keySet());\n ^\n required: Collection<? extends E>\n found: Set\n where E is a type-variable:\n E extends Object declared in method <E>copyOf(Collection<? extends E>)\n/root/ansible_virtualenvs/2.4.0/metron/metron-platform/metron-test-utilities/src/main/java/org/apache/metron/test/bolt/BaseBoltTest.java:87: warning: [unchecked] unchecked conversion\n ImmutableSet keys = ImmutableSet.copyOf(message.keySet());\n ^\n required: Collection<? extends E>\n found: Set\n where E is a type-variable:\n E extends Object declared in method <E>copyOf(Collection<? extends E>)\n/root/ansible_virtualenvs/2.4.0/metron/metron-platform/metron-test-utilities/src/main/java/org/apache/metron/test/utils/KafkaLoader.java:64: warning: [unchecked] unchecked call to send(ProducerRecord<K,V>) as a member of the raw type KafkaProducer\n kafkaProducer.send(new ProducerRecord<String, String>(topic, line));\n ^\n where K,V are type-variables:\n K extends Object declared in class KafkaProducer\n V extends Object declared in class KafkaProducer\n/root/ansible_virtualenvs/2.4.0/metron/metron-platform/metron-test-utilities/src/main/java/org/apache/metron/test/utils/KafkaLoader.java:61: warning: [DefaultCharset] Implicit use of the platform default charset, which can result in e.g. non-ASCII characters being silently replaced with '?' in many environments\n BufferedReader reader = new BufferedReader(new FileReader(samplePath));\n ^\n (see http://errorprone.info/bugpattern/DefaultCharset)\n Did you mean 'BufferedReader reader = Files.newBufferedReader(Paths.get(samplePath), UTF_8);' or 'BufferedReader reader = Files.newBufferedReader(Paths.get(samplePath), Charset.defaultCharset());'?\n/root/ansible_virtualenvs/2.4.0/metron/metron-platform/metron-test-utilities/src/main/java/org/apache/metron/test/spouts/GenericInternalTestSpout.java:117: warning: [DefaultCharset] Implicit use of the platform default charset, which can result in e.g. non-ASCII characters being silently replaced with '?' in many environments\n\t\t\t\tvalue = jsons.get(cnt).getBytes();\n\t\t\t\t ^\n (see http://errorprone.info/bugpattern/DefaultCharset)\n Did you mean 'value = jsons.get(cnt).getBytes(UTF_8);' or 'value = jsons.get(cnt).getBytes(Charset.defaultCharset());'?\n/root/ansible_virtualenvs/2.4.0/metron/metron-platform/metron-test-utilities/src/main/java/org/apache/metron/test/converters/BinaryConverters.java:22: warning: [DefaultCharset] Implicit use of the platform default charset, which can result in e.g. non-ASCII characters being silently replaced with '?' in many environments\n return s.getBytes();\n ^\n (see http://errorprone.info/bugpattern/DefaultCharset)\n Did you mean 'return s.getBytes(UTF_8);' or 'return s.getBytes(Charset.defaultCharset());'?\n9 warnings\n/root/ansible_virtualenvs/2.4.0/metron/metron-stellar/stellar-common/src/main/java/org/apache/metron/stellar/common/generated/StellarParser.java:3045: warning: [MissingOverride] sempred overrides method in Recognizer; expected @Override\n\tpublic boolean sempred(RuleContext _localctx, int ruleIndex, int predIndex) {\n\t ^\n (see http://errorprone.info/bugpattern/MissingOverride)\n Did you mean '@Override public boolean sempred(RuleContext _localctx, int ruleIndex, int predIndex) {'?\n/root/ansible_virtualenvs/2.4.0/metron/metron-stellar/stellar-common/src/main/java/org/apache/metron/stellar/common/utils/SerDeUtils.java:136: warning: [unchecked] newInstantiatorOf(Class) in DefaultInstantiatorStrategy implements <T>newInstantiatorOf(Class<T>) in InstantiatorStrategy\n public ObjectInstantiator newInstantiatorOf(final Class type) {\n ^\n return type requires unchecked conversion from ObjectInstantiator to ObjectInstantiator<T>\n where T is a type-variable:\n T extends Object declared in method <T>newInstantiatorOf(Class<T>)\n2 warnings",

"stderr_lines": [

"/root/ansible_virtualenvs/2.4.0/metron/metron-platform/metron-zookeeper/src/main/java/org/apache/metron/zookeeper/SimpleEventListener.java:114: warning: [DefaultCharset] Implicit use of the platform default charset, which can result in e.g. non-ASCII characters being silently replaced with '?' in many environments",

" LOG.debug(\"Type: {}, Path: {}, Data: {}\", event.getType(), (path == null?\"\":path) , (data == null?\"\":new String(data)));",

" ^",

" (see http://errorprone.info/bugpattern/DefaultCharset)",

" Did you mean 'LOG.debug(\"Type: {}, Path: {}, Data: {}\", event.getType(), (path == null?\"\":path) , (data == null?\"\":new String(data, UTF_8)));' or 'LOG.debug(\"Type: {}, Path: {}, Data: {}\", event.getType(), (path == null?\"\":path) , (data == null?\"\":new String(data, Charset.defaultCharset())));'?",

"1 warning",

"warning: No SupportedSourceVersion annotation found on org.adrianwalker.multilinestring.MultilineProcessor, returning RELEASE_6.",

"warning: Supported source version 'RELEASE_6' from annotation processor 'org.adrianwalker.multilinestring.MultilineProcessor' less than -source '1.8'",

"2 warnings",

"warning: No SupportedSourceVersion annotation found on org.adrianwalker.multilinestring.MultilineProcessor, returning RELEASE_6.",

"warning: Supported source version 'RELEASE_6' from annotation processor 'org.adrianwalker.multilinestring.MultilineProcessor' less than -source '1.8'",

"/root/ansible_virtualenvs/2.4.0/metron/metron-platform/metron-test-utilities/src/main/java/org/apache/metron/test/filereaders/FileReader.java:42: warning: [DefaultCharset] Implicit use of the platform default charset, which can result in e.g. non-ASCII characters being silently replaced with '?' in many environments",

"\t\tBufferedReader br = new BufferedReader(new InputStreamReader(in));",

"\t\t ^",

" (see http://errorprone.info/bugpattern/DefaultCharset)",

" Did you mean 'BufferedReader br = new BufferedReader(new InputStreamReader(in, UTF_8));' or 'BufferedReader br = new BufferedReader(new InputStreamReader(in, Charset.defaultCharset()));'?",

"/root/ansible_virtualenvs/2.4.0/metron/metron-platform/metron-test-utilities/src/main/java/org/apache/metron/test/bolt/BaseBoltTest.java:87: warning: [unchecked] unchecked method invocation: method copyOf in class ImmutableSet is applied to given types",

" ImmutableSet keys = ImmutableSet.copyOf(message.keySet());",

" ^",

" required: Collection<? extends E>",

" found: Set",

" where E is a type-variable:",

" E extends Object declared in method <E>copyOf(Collection<? extends E>)",

"/root/ansible_virtualenvs/2.4.0/metron/metron-platform/metron-test-utilities/src/main/java/org/apache/metron/test/bolt/BaseBoltTest.java:87: warning: [unchecked] unchecked conversion",

" ImmutableSet keys = ImmutableSet.copyOf(message.keySet());",

" ^",

" required: Collection<? extends E>",

" found: Set",

" where E is a type-variable:",

" E extends Object declared in method <E>copyOf(Collection<? extends E>)",

"/root/ansible_virtualenvs/2.4.0/metron/metron-platform/metron-test-utilities/src/main/java/org/apache/metron/test/utils/KafkaLoader.java:64: warning: [unchecked] unchecked call to send(ProducerRecord<K,V>) as a member of the raw type KafkaProducer",

" kafkaProducer.send(new ProducerRecord<String, String>(topic, line));",

" ^",

" where K,V are type-variables:",

" K extends Object declared in class KafkaProducer",

" V extends Object declared in class KafkaProducer",

"/root/ansible_virtualenvs/2.4.0/metron/metron-platform/metron-test-utilities/src/main/java/org/apache/metron/test/utils/KafkaLoader.java:61: warning: [DefaultCharset] Implicit use of the platform default charset, which can result in e.g. non-ASCII characters being silently replaced with '?' in many environments",

" BufferedReader reader = new BufferedReader(new FileReader(samplePath));",

" ^",

" (see http://errorprone.info/bugpattern/DefaultCharset)",

" Did you mean 'BufferedReader reader = Files.newBufferedReader(Paths.get(samplePath), UTF_8);' or 'BufferedReader reader = Files.newBufferedReader(Paths.get(samplePath), Charset.defaultCharset());'?",

"/root/ansible_virtualenvs/2.4.0/metron/metron-platform/metron-test-utilities/src/main/java/org/apache/metron/test/spouts/GenericInternalTestSpout.java:117: warning: [DefaultCharset] Implicit use of the platform default charset, which can result in e.g. non-ASCII characters being silently replaced with '?' in many environments",

"\t\t\t\tvalue = jsons.get(cnt).getBytes();",

"\t\t\t\t ^",

" (see http://errorprone.info/bugpattern/DefaultCharset)",

" Did you mean 'value = jsons.get(cnt).getBytes(UTF_8);' or 'value = jsons.get(cnt).getBytes(Charset.defaultCharset());'?",

"/root/ansible_virtualenvs/2.4.0/metron/metron-platform/metron-test-utilities/src/main/java/org/apache/metron/test/converters/BinaryConverters.java:22: warning: [DefaultCharset] Implicit use of the platform default charset, which can result in e.g. non-ASCII characters being silently replaced with '?' in many environments",

" return s.getBytes();",

" ^",

" (see http://errorprone.info/bugpattern/DefaultCharset)",

" Did you mean 'return s.getBytes(UTF_8);' or 'return s.getBytes(Charset.defaultCharset());'?",

"9 warnings",

"/root/ansible_virtualenvs/2.4.0/metron/metron-stellar/stellar-common/src/main/java/org/apache/metron/stellar/common/generated/StellarParser.java:3045: warning: [MissingOverride] sempred overrides method in Recognizer; expected @Override",

"\tpublic boolean sempred(RuleContext _localctx, int ruleIndex, int predIndex) {",

"\t ^",

" (see http://errorprone.info/bugpattern/MissingOverride)",

" Did you mean '@Override public boolean sempred(RuleContext _localctx, int ruleIndex, int predIndex) {'?",

"/root/ansible_virtualenvs/2.4.0/metron/metron-stellar/stellar-common/src/main/java/org/apache/metron/stellar/common/utils/SerDeUtils.java:136: warning: [unchecked] newInstantiatorOf(Class) in DefaultInstantiatorStrategy implements <T>newInstantiatorOf(Class<T>) in InstantiatorStrategy",

" public ObjectInstantiator newInstantiatorOf(final Class type) {",

" ^",

" return type requires unchecked conversion from ObjectInstantiator to ObjectInstantiator<T>",

" where T is a type-variable:",

" T extends Object declared in method <T>newInstantiatorOf(Class<T>)",

"2 warnings"

],

"stdout": "[INFO] Scanning for projects...\n[WARNING] \n[WARNING] Some problems were encountered while building the effective model for org.apache.metron:metron-profiler-storm:jar:0.7.1\n[WARNING] 'dependencies.dependency.(groupId:artifactId:type:classifier)' must be unique: org.apache.metron:metron-integration-test:jar -> duplicate declaration of version ${project.parent.version} @ org.apache.metron:metron-profiler-storm:[unknown-version], /root/ansible_virtualenvs/2.4.0/metron/metron-analytics/metron-profiler-storm/pom.xml, line 314, column 21\n[WARNING] \n[WARNING] Some problems were encountered while building the effective model for org.apache.metron:metron-writer:jar:0.7.1\n[WARNING] 'dependencies.dependency.(groupId:artifactId:type:classifier)' must be unique: org.apache.httpcomponents:httpclient:jar -> duplicate declaration of version ${global_httpclient_version} @ org.apache.metron:metron-writer:[unknown-version], /root/ansible_virtualenvs/2.4.0/metron/metron-platform/metron-writer/pom.xml, line 248, column 21\n[WARNING] \n[WARNING] It is highly recommended to fix these problems because they threaten the stability of your build.\n[WARNING] \n[WARNING] For this reason, future Maven versions might no longer support building such malformed projects.\n[WARNING] \n[INFO] ------------------------------------------------------------------------\n[INFO] Reactor Build Order:\n[INFO] \n[INFO] Metron\n[INFO] metron-stellar\n[INFO] stellar-common\n[INFO] metron-analytics\n[INFO] metron-maas-common\n[INFO] metron-platform\n[INFO] metron-zookeeper\n[INFO] metron-test-utilities\n[INFO] metron-integration-test\n[INFO] metron-maas-service\n[INFO] metron-common\n[INFO] metron-statistics\n[INFO] metron-hbase\n[INFO] metron-enrichment\n[INFO] metron-enrichment-common\n[INFO] metron-writer\n[INFO] metron-storm-kafka-override\n[INFO] metron-storm-kafka\n[INFO] metron-profiler-common\n[INFO] metron-profiler-client\n[INFO] metron-profiler-storm\n[INFO] metron-profiler-spark\n[INFO] metron-profiler-repl\n[INFO] metron-hbase-client\n[INFO] metron-enrichment-storm\n[INFO] metron-indexing\n[INFO] metron-solr\n[INFO] metron-job\n[INFO] metron-pcap\n[INFO] metron-pcap-backend\n[INFO] metron-data-management\n[INFO] metron-parsing\n[INFO] metron-parsers-common\n[INFO] metron-parsers\n[INFO] metron-management\n[INFO] elasticsearch-shaded\n[INFO] metron-elasticsearch\n[INFO] metron-parsing-storm\n[INFO] metron-deployment\n[INFO] Elasticsearch Ambari Management Pack\n[INFO] Metron Ambari Management Pack\n[INFO] metron-contrib\n[INFO] metron-docker\n[INFO] metron-performance\n[INFO] metron-interface\n[INFO] metron-config\n[INFO] metron-alerts\n[INFO] metron-rest-client\n[INFO] metron-rest\n[INFO] site-book\n[INFO] 3rd party Functions (just for tests)\n[INFO] stellar-zeppelin\n[INFO] \n[INFO] Using the MultiThreadedBuilder implementation with a thread count of 8\n[INFO] \n[INFO] ------------------------------------------------------------------------\n[INFO] Building Metron 0.7.1\n[INFO] ------------------------------------------------------------------------\n[INFO] \n[INFO] --- maven-enforcer-plugin:1.4.1:enforce (enforce-versions) @ Metron ---\n[INFO] \n[INFO] --- jacoco-maven-plugin:0.7.9:prepare-agent (default) @ Metron ---\n[INFO] argLine set to -javaagent:/root/.m2/repository/org/jacoco/org.jacoco.agent/0.7.9/org.jacoco.agent-0.7.9-runtime.jar=destfile=/root/ansible_virtualenvs/2.4.0/metron/target/jacoco.exec\n[INFO] \n[INFO] --- jacoco-maven-plugin:0.7.9:report (report) @ Metron ---\n[INFO] Skipping JaCoCo execution due to missing execution data file.\n[INFO] \n[INFO] ------------------------------------------------------------------------\n[INFO] Building metron-stellar 0.7.1\n[INFO] ------------------------------------------------------------------------\n[INFO] \n[INFO] ------------------------------------------------------------------------\n[INFO] Building metron-analytics 0.7.1\n[INFO] ------------------------------------------------------------------------\n[INFO] \n[INFO] ------------------------------------------------------------------------\n[INFO] Building metron-platform 0.7.1\n[INFO] ------------------------------------------------------------------------\n[INFO] \n[INFO] ------------------------------------------------------------------------\n[INFO] Building metron-deployment 0.7.1\n[INFO] ------------------------------------------------------------------------\n[INFO] \n[INFO] --- maven-enforcer-plugin:1.4.1:enforce (enforce-versions) @ metron-deployment ---\n[INFO] \n[INFO] --- jacoco-maven-plugin:0.7.9:prepare-agent (default) @ metron-deployment ---\n[INFO] argLine set to -javaagent:/root/.m2/repository/org/jacoco/org.jacoco.agent/0.7.9/org.jacoco.agent-0.7.9-runtime.jar=destfile=/root/ansible_virtualenvs/2.4.0/metron/metron-deployment/target/jacoco.exec\n[INFO] \n[INFO] --- jacoco-maven-plugin:0.7.9:report (report) @ metron-deployment ---\n[INFO] Skipping JaCoCo execution due to missing execution data file.\n[INFO] \n[INFO] ------------------------------------------------------------------------\n[INFO] Building metron-contrib 0.7.1\n[INFO] ------------------------------------------------------------------------\n[INFO] \n[INFO] ------------------------------------------------------------------------\n[INFO] Building metron-interface 0.7.1\n[INFO] ------------------------------------------------------------------------\n[INFO] \n[INFO] --- maven-enforcer-plugin:1.4.1:enforce (enforce-versions) @ metron-contrib ---\n[INFO] \n[INFO] --- jacoco-maven-plugin:0.7.9:prepare-agent (default) @ metron-contrib ---\n[INFO] argLine set to -javaagent:/root/.m2/repository/org/jacoco/org.jacoco.agent/0.7.9/org.jacoco.agent-0.7.9-runtime.jar=destfile=/root/ansible_virtualenvs/2.4.0/metron/metron-contrib/target/jacoco.exec\n[INFO] \n[INFO] --- maven-enforcer-plugin:1.4.1:enforce (enforce-versions) @ metron-interface ---\n[INFO] \n[INFO] --- maven-enforcer-plugin:1.4.1:enforce (enforce-versions) @ metron-analytics ---\n[INFO] \n[INFO] --- jacoco-maven-plugin:0.7.9:prepare-agent (default) @ metron-analytics ---\n[INFO] \n[INFO] ------------------------------------------------------------------------\n[INFO] Building site-book 0.7.1\n[INFO] ------------------------------------------------------------------------\n[INFO] argLine set to -javaagent:/root/.m2/repository/org/jacoco/org.jacoco.agent/0.7.9/org.jacoco.agent-0.7.9-runtime.jar=destfile=/root/ansible_virtualenvs/2.4.0/metron/metron-analytics/target/jacoco.exec\n[INFO] \n[INFO] --- jacoco-maven-plugin:0.7.9:report (report) @ metron-analytics ---\n[INFO] \n[INFO] \n[INFO] \n[INFO] ------------------------------------------------------------------------\n[INFO] Building Metron Ambari Management Pack 0.7.1.0\n[INFO] ------------------------------------------------------------------------\n[INFO] \n[INFO] --- jacoco-maven-plugin:0.7.9:prepare-agent (default) @ metron-interface ---\n[INFO] ------------------------------------------------------------------------\n[INFO] Building Elasticsearch Ambari Management Pack 0.7.1.0\n[INFO] ------------------------------------------------------------------------\n[INFO] --- jacoco-maven-plugin:0.7.9:report (report) @ metron-contrib ---\n[INFO] \n[INFO] --- maven-enforcer-plugin:1.4.1:enforce (enforce-versions) @ metron-platform ---\n[INFO] \n[INFO] --- maven-enforcer-plugin:1.4.1:enforce (enforce-versions) @ metron-stellar ---\n[INFO] \n[INFO] --- jacoco-maven-plugin:0.7.9:prepare-agent (default) @ metron-stellar ---\n[INFO] \n[INFO] --- jacoco-maven-plugin:0.7.9:prepare-agent (default) @ metron-platform ---\n[INFO] Skipping JaCoCo execution due to missing execution data file.\n[INFO] \n[INFO] ------------------------------------------------------------------------\n[INFO] Building metron-docker 0.7.1\n[INFO] ------------------------------------------------------------------------\n[INFO] argLine set to -javaagent:/root/.m2/repository/org/jacoco/org.jacoco.agent/0.7.9/org.jacoco.agent-0.7.9-runtime.jar=destfile=/root/ansible_virtualenvs/2.4.0/metron/metron-stellar/target/jacoco.exec\n[INFO] \n[INFO] --- jacoco-maven-plugin:0.7.9:report (report) @ metron-stellar ---\n[INFO] \n[INFO] --- maven-enforcer-plugin:1.4.1:enforce (enforce-versions) @ site-book ---\n[INFO] argLine set to -javaagent:/root/.m2/repository/org/jacoco/org.jacoco.agent/0.7.9/org.jacoco.agent-0.7.9-runtime.jar=destfile=/root/ansible_virtualenvs/2.4.0/metron/metron-interface/target/jacoco.exec\n[INFO] \n[INFO] --- jacoco-maven-plugin:0.7.9:report (report) @ metron-interface ---\n[INFO] Skipping JaCoCo execution due to missing execution data file.\n[INFO] \n[INFO] ------------------------------------------------------------------------\n[INFO] Building metron-config 0.7.1\n[INFO] ------------------------------------------------------------------------\n[INFO] Skipping JaCoCo execution due to missing execution data file.\n[INFO] \n[INFO] ------------------------------------------------------------------------\n[INFO] Building metron-alerts 0.7.1\n[INFO] ------------------------------------------------------------------------\n[INFO] Skipping JaCoCo execution due to missing execution data file.\n[INFO] \n[INFO] --- jacoco-maven-plugin:0.7.9:prepare-agent (default) @ site-book ---\n[INFO] \n[INFO] ------------------------------------------------------------------------\n[INFO] Building stellar-common 0.7.1\n[INFO] ------------------------------------------------------------------------\n[INFO] argLine set to -javaagent:/root/.m2/repository/org/jacoco/org.jacoco.agent/0.7.9/org.jacoco.agent-0.7.9-runtime.jar=destfile=/root/ansible_virtualenvs/2.4.0/metron/site-book/target/jacoco.exec\n[INFO] argLine set to -javaagent:/root/.m2/repository/org/jacoco/org.jacoco.agent/0.7.9/org.jacoco.agent-0.7.9-runtime.jar=destfile=/root/ansible_virtualenvs/2.4.0/metron/metron-platform/target/jacoco.exec\n[INFO] \n[INFO] --- maven-site-plugin:3.7:site (default) @ site-book ---\n[INFO] \n[INFO] --- jacoco-maven-plugin:0.7.9:report (report) @ metron-platform ---\n[INFO] \n[INFO] --- maven-enforcer-plugin:1.4.1:enforce (enforce-versions) @ metron_mpack ---\n[INFO] Skipping JaCoCo execution due to missing execution data file.\n[INFO] \n[INFO] ------------------------------------------------------------------------\n[INFO] Building metron-zookeeper 0.7.1\n[INFO] ------------------------------------------------------------------------\n[INFO] \n[INFO] --- maven-enforcer-plugin:1.4.1:enforce (enforce-versions) @ elasticsearch_mpack ---\n[INFO] \n[INFO] --- maven-enforcer-plugin:1.4.1:enforce (enforce-versions) @ metron-docker ---\n[INFO] \n[INFO] --- build-helper-maven-plugin:1.8:parse-version (parse-version) @ metron_mpack ---\n[INFO] \n[INFO] --- jacoco-maven-plugin:0.7.9:prepare-agent (default) @ metron-docker ---\n[INFO] \n[INFO] --- jacoco-maven-plugin:0.7.9:prepare-agent (default) @ elasticsearch_mpack ---\n[INFO] \n[INFO] --- maven-enforcer-plugin:1.4.1:enforce (enforce-versions) @ metron-alerts ---\n[INFO] \n[INFO] --- maven-enforcer-plugin:1.4.1:enforce (enforce-versions) @ metron-zookeeper ---\n[INFO] \n[INFO] --- jacoco-maven-plugin:0.7.9:prepare-agent (default) @ metron-zookeeper ---\n[INFO] argLine set to -javaagent:/root/.m2/repository/org/jacoco/org.jacoco.agent/0.7.9/org.jacoco.agent-0.7.9-runtime.jar=destfile=/root/ansible_virtualenvs/2.4.0/metron/metron-platform/metron-zookeeper/target/jacoco.exec\n[INFO] \n[INFO] --- maven-resources-plugin:2.6:resources (default-resources) @ metron-zookeeper ---\n[INFO] \n[INFO] --- build-helper-maven-plugin:1.8:regex-property (metron-version) @ metron_mpack ---\n[INFO] argLine set to -javaagent:/root/.m2/repository/org/jacoco/org.jacoco.agent/0.7.9/org.jacoco.agent-0.7.9-runtime.jar=destfile=/root/ansible_virtualenvs/2.4.0/metron/metron-deployment/packaging/ambari/elasticsearch-mpack/target/jacoco.exec\n[INFO] \n[INFO] --- maven-resources-plugin:2.6:resources (default-resources) @ elasticsearch_mpack ---\n[INFO] argLine set to -javaagent:/root/.m2/repository/org/jacoco/org.jacoco.agent/0.7.9/org.jacoco.agent-0.7.9-runtime.jar=destfile=/root/ansible_virtualenvs/2.4.0/metron/metron-contrib/metron-docker/target/jacoco.exec\n[INFO] \n[INFO] --- jacoco-maven-plugin:0.7.9:report (report) @ metron-docker ---\n[INFO] Skipping JaCoCo execution due to missing execution data file.\n[INFO] \n[INFO] --- maven-resources-plugin:3.0.1:copy-resources (copy-common-to-kafkazk) @ metron-docker ---\n[INFO] \n[INFO] --- maven-enforcer-plugin:1.4.1:enforce (enforce-versions) @ metron-config ---\n[INFO] \n[INFO] --- jacoco-maven-plugin:0.7.9:prepare-agent (default) @ metron-alerts ---\n[INFO] Using 'UTF-8' encoding to copy filtered resources.\n[INFO] Using 'UTF-8' encoding to copy filtered resources.\n[INFO] skip non existing resourceDirectory /root/ansible_virtualenvs/2.4.0/metron/metron-platform/metron-zookeeper/src/main/resources\n[INFO] \n[INFO] --- maven-compiler-plugin:3.5.1:compile (default-compile) @ metron-zookeeper ---\n[INFO] Copying 31 resources\n[INFO] \n[INFO] --- maven-compiler-plugin:3.5.1:compile (default-compile) @ elasticsearch_mpack ---\n[INFO] No match to regex '-SNAPSHOT' found in '0.7.1'. The initial value '0.7.1' is left as-is...\n[INFO] \n[INFO] --- build-helper-maven-plugin:1.8:regex-property (metron-short-version) @ metron_mpack ---\n[INFO] Using 'UTF-8' encoding to copy filtered resources.\n[INFO] skip non existing resourceDirectory /root/ansible_virtualenvs/2.4.0/metron/metron-platform/metron-common/target\n[INFO] \n[INFO] --- maven-resources-plugin:3.0.1:copy-resources (copy-parsers-to-kafkazk) @ metron-docker ---\n[INFO] Relativizing decoration links with respect to localized project URL: https://metron.apache.org/\n[INFO] Rendering site with org.apache.maven.skins:maven-default-skin:jar:1.2 skin.\n[INFO] \n[INFO] --- jacoco-maven-plugin:0.7.9:report (report) @ site-book ---\n[INFO] argLine set to -javaagent:/root/.m2/repository/org/jacoco/org.jacoco.agent/0.7.9/org.jacoco.agent-0.7.9-runtime.jar=destfile=/root/ansible_virtualenvs/2.4.0/metron/metron-interface/metron-alerts/target/jacoco.exec\n[INFO] \n[INFO] --- frontend-maven-plugin:1.3:install-node-and-npm (install node and npm) @ metron-alerts ---\n[INFO] No sources to compile\n[INFO] \n[INFO] --- maven-resources-plugin:2.6:copy-resources (copy-resources) @ elasticsearch_mpack ---\n[INFO] Changes detected - recompiling the module!\n[INFO] Compiling 2 source files to /root/ansible_virtualenvs/2.4.0/metron/metron-platform/metron-zookeeper/target/classes\n[INFO] Using 'UTF-8' encoding to copy filtered resources.\n[INFO] skip non existing resourceDirectory /root/ansible_virtualenvs/2.4.0/metron/metron-platform/metron-parsing/metron-parsers-common/target\n[INFO] \n[INFO] --- maven-resources-plugin:3.0.1:copy-resources (copy-enrichment-to-kafkazk) @ metron-docker ---\n[INFO] \n[INFO] --- jacoco-maven-plugin:0.7.9:prepare-agent (default) @ metron-config ---\n[INFO] argLine set to -javaagent:/root/.m2/repository/org/jacoco/org.jacoco.agent/0.7.9/org.jacoco.agent-0.7.9-runtime.jar=destfile=/root/ansible_virtualenvs/2.4.0/metron/metron-interface/metron-config/target/jacoco.exec\n[INFO] \n[INFO] --- frontend-maven-plugin:1.3:install-node-and-npm (install node and npm) @ metron-config ---\n[INFO] Using 'UTF-8' encoding to copy filtered resources.\n[INFO] skip non existing resourceDirectory /root/ansible_virtualenvs/2.4.0/metron/metron-platform/metron-parsing/metron-enrichment/target\n[INFO] \n[INFO] --- maven-resources-plugin:3.0.1:copy-resources (copy-indexing-to-kafkazk) @ metron-docker ---\n[INFO] Using 'UTF-8' encoding to copy filtered resources.\n[INFO] skip non existing resourceDirectory /root/ansible_virtualenvs/2.4.0/metron/metron-platform/metron-indexing/target\n[INFO] \n[INFO] --- maven-resources-plugin:3.0.1:copy-resources (copy-templates-to-elasticsearch) @ metron-docker ---\n[INFO] \n[INFO] --- jacoco-maven-plugin:0.7.9:prepare-agent (default) @ metron_mpack ---\n[INFO] Using 'UTF-8' encoding to copy filtered resources.\n[INFO] skip non existing resourceDirectory /root/ansible_virtualenvs/2.4.0/metron/metron-deployment/roles/metron_elasticsearch_templates/files/es_templates\n[INFO] \n[INFO] --- maven-resources-plugin:3.0.1:copy-resources (copy-data-management-to-hbase) @ metron-docker ---\n[INFO] argLine set to -javaagent:/root/.m2/repository/org/jacoco/org.jacoco.agent/0.7.9/org.jacoco.agent-0.7.9-runtime.jar=destfile=/root/ansible_virtualenvs/2.4.0/metron/metron-deployment/packaging/ambari/metron-mpack/target/jacoco.exec\n[INFO] \n[INFO] --- maven-resources-plugin:2.6:resources (default-resources) @ metron_mpack ---\n[INFO] Using 'UTF-8' encoding to copy filtered resources.\n[INFO] skip non existing resourceDirectory /root/ansible_virtualenvs/2.4.0/metron/metron-platform/metron-data-management/target\n[INFO] Skipping JaCoCo execution due to missing execution data file.\n[INFO] \n[INFO] ------------------------------------------------------------------------\n[INFO] Building metron-storm-kafka-override 0.7.1\n[INFO] ------------------------------------------------------------------------\n[INFO] Using 'UTF-8' encoding to copy filtered resources.\n[INFO] Using 'UTF-8' encoding to copy filtered resources.\n[INFO] \n[INFO] --- maven-resources-plugin:3.0.1:copy-resources (copy-parsers-to-storm) @ metron-docker ---\n[INFO] Copying 1 resource\n[INFO] Using 'UTF-8' encoding to copy filtered resources.\n[INFO] skip non existing resourceDirectory /root/ansible_virtualenvs/2.4.0/metron/metron-platform/metron-parsing/metron-parsers-common/target\n[INFO] \n[INFO] --- maven-resources-plugin:3.0.1:copy-resources (copy-enrichment-to-storm) @ metron-docker ---\n[INFO] Using 'UTF-8' encoding to copy filtered resources.\n[INFO] skip non existing resourceDirectory /root/ansible_virtualenvs/2.4.0/metron/metron-platform/metron-enrichment/target\n[INFO] \n[INFO] --- maven-resources-plugin:3.0.1:copy-resources (copy-indexing-to-storm) @ metron-docker ---\n[INFO] Using 'UTF-8' encoding to copy filtered resources.\n[INFO] skip non existing resourceDirectory /root/ansible_virtualenvs/2.4.0/metron/metron-platform/metron-indexing/target\n[INFO] \n[INFO] --- maven-resources-plugin:3.0.1:copy-resources (copy-elasticsearch-to-storm) @ metron-docker ---\n[INFO] Copying 66 resources\n[INFO] Using 'UTF-8' encoding to copy filtered resources.\n[INFO] skip non existing resourceDirectory /root/ansible_virtualenvs/2.4.0/metron/metron-platform/metron-elasticsearch/target\n[INFO] \n[INFO] --- maven-resources-plugin:3.0.1:copy-resources (filter-docker-env) @ metron-docker ---\n[INFO] Using 'UTF-8' encoding to copy filtered resources.\n[INFO] \n[INFO] --- maven-resources-plugin:2.6:testResources (default-testResources) @ elasticsearch_mpack ---\n[INFO] Using 'UTF-8' encoding to copy filtered resources.\n[INFO] skip non existing resourceDirectory /root/ansible_virtualenvs/2.4.0/metron/metron-deployment/packaging/ambari/elasticsearch-mpack/src/test/resources\n[INFO] \n[INFO] --- maven-compiler-plugin:3.5.1:testCompile (default-testCompile) @ elasticsearch_mpack ---\n[INFO] Installing node version v9.11.1\n[INFO] No sources to compile\n[INFO] \n[INFO] --- maven-surefire-plugin:2.18:test (default-test) @ elasticsearch_mpack ---\n[INFO] Unpacking /root/.m2/repository/com/github/eirslett/node/9.11.1/node-9.11.1-linux-x64.tar.gz into /root/ansible_virtualenvs/2.4.0/metron/metron-interface/metron-config/node/tmp\n[INFO] Copying 1 resource\n[INFO] \n[INFO] --- maven-compiler-plugin:3.5.1:compile (default-compile) @ metron_mpack ---\n[INFO] \n[INFO] --- maven-resources-plugin:3.0.1:copy-resources (copy-wait-for-it-to-hbase) @ metron-docker ---\n[INFO] \n[INFO] --- maven-enforcer-plugin:1.4.1:enforce (enforce-versions) @ metron-storm-kafka-override ---\n[INFO] \n[INFO] --- jacoco-maven-plugin:0.7.9:prepare-agent (default) @ metron-storm-kafka-override ---\n[INFO] Using 'UTF-8' encoding to copy filtered resources.\n[INFO] argLine set to -javaagent:/root/.m2/repository/org/jacoco/org.jacoco.agent/0.7.9/org.jacoco.agent-0.7.9-runtime.jar=destfile=/root/ansible_virtualenvs/2.4.0/metron/metron-platform/metron-storm-kafka-override/target/jacoco.exec\n[INFO] \n[INFO] --- maven-resources-plugin:2.6:resources (default-resources) @ metron-storm-kafka-override ---\n[INFO] Copying 1 resource\n[INFO] Using 'UTF-8' encoding to copy filtered resources.\n[INFO] skip non existing resourceDirectory /root/ansible_virtualenvs/2.4.0/metron/metron-platform/metron-storm-kafka-override/src/main/resources\n[INFO] \n[INFO] --- maven-compiler-plugin:3.5.1:compile (default-compile) @ metron-storm-kafka-override ---\n[INFO] Changes detected - recompiling the module!\n[INFO] Compiling 2 source files to /root/ansible_virtualenvs/2.4.0/metron/metron-platform/metron-storm-kafka-override/target/classes\n[INFO] No sources to compile\n[INFO] \n[INFO] --- maven-resources-plugin:2.6:copy-resources (copy-resources) @ metron_mpack ---\n[INFO] Using 'UTF-8' encoding to copy filtered resources.\n[INFO] Copying 1 resource\n[INFO] \n[INFO] --- maven-resources-plugin:3.0.1:copy-resources (copy-wait-for-it-to-kafkazk) @ metron-docker ---\n[INFO] Using 'UTF-8' encoding to copy filtered resources.\n[INFO] Copying 1 resource\n[INFO] \n[INFO] --- maven-resources-plugin:3.0.1:copy-resources (copy-wait-for-it-to-elasticsearch) @ metron-docker ---\n[INFO] Using 'UTF-8' encoding to copy filtered resources.\n[INFO] Copying 1 resource\n[INFO] \n[INFO] ------------------------------------------------------------------------\n[INFO] Building metron-hbase-client 0.7.1\n[INFO] ------------------------------------------------------------------------\n[INFO] \n[INFO] --- maven-resources-plugin:2.6:testResources (default-testResources) @ metron_mpack ---\n[INFO] Using 'UTF-8' encoding to copy filtered resources.\n[INFO] skip non existing resourceDirectory /root/ansible_virtualenvs/2.4.0/metron/metron-deployment/packaging/ambari/metron-mpack/src/test/resources\n[INFO] \n[INFO] --- maven-compiler-plugin:3.5.1:testCompile (default-testCompile) @ metron_mpack ---\n[INFO] No sources to compile\n[INFO] \n[INFO] --- maven-surefire-plugin:2.18:test (default-test) @ metron_mpack ---\n[INFO] Tests are skipped.\n[INFO] \n[INFO] --- maven-surefire-plugin:2.18:test (unit-tests) @ metron_mpack ---\n[INFO] Tests are skipped.\n[INFO] \n[INFO] --- jacoco-maven-plugin:0.7.9:report (report) @ metron_mpack ---\n[INFO] Skipping JaCoCo execution due to missing execution data file.\n[INFO] \n[INFO] --- maven-resources-plugin:2.6:copy-resources (copy-property-templates) @ metron_mpack ---\n[INFO] Tests are skipped.\n[INFO] \n[INFO] --- maven-surefire-plugin:2.18:test (unit-tests) @ elasticsearch_mpack ---\n[INFO] Using 'UTF-8' encoding to copy filtered resources.\n[INFO] Copying 2 resources\n[INFO] \n[INFO] --- maven-enforcer-plugin:1.4.1:enforce (enforce-versions) @ metron-hbase-client ---\n[INFO] Copying 1 resource\n[INFO] Copying 1 resource\n[INFO] Copying 1 resource\n[INFO] Copying 1 resource\n[INFO] Tests are skipped.\n[INFO] \n[INFO] --- jacoco-maven-plugin:0.7.9:report (report) @ elasticsearch_mpack ---\n[INFO] \n[INFO] --- maven-assembly-plugin:2.6:single (build-tarball) @ metron_mpack ---\n[INFO] Skipping JaCoCo execution due to missing execution data file.\n[INFO] \n[INFO] --- maven-assembly-plugin:2.6:single (build-tarball) @ elasticsearch_mpack ---\n[INFO] \n[INFO] --- jacoco-maven-plugin:0.7.9:prepare-agent (default) @ metron-hbase-client ---\n[INFO] \n[INFO] --- maven-enforcer-plugin:1.4.1:enforce (enforce-versions) @ stellar-common ---\n[INFO] argLine set to -javaagent:/root/.m2/repository/org/jacoco/org.jacoco.agent/0.7.9/org.jacoco.agent-0.7.9-runtime.jar=destfile=/root/ansible_virtualenvs/2.4.0/metron/metron-platform/metron-hbase-client/target/jacoco.exec\n[INFO] \n[INFO] --- maven-resources-plugin:2.6:resources (default-resources) @ metron-hbase-client ---\n[INFO] Using 'UTF-8' encoding to copy filtered resources.\n[INFO] skip non existing resourceDirectory /root/ansible_virtualenvs/2.4.0/metron/metron-platform/metron-hbase-client/src/main/resources\n[INFO] \n[INFO] --- maven-compiler-plugin:3.5.1:compile (default-compile) @ metron-hbase-client ---\n[INFO] No sources to compile\n[INFO] \n[INFO] --- maven-resources-plugin:2.6:testResources (default-testResources) @ metron-hbase-client ---\n[INFO] Using 'UTF-8' encoding to copy filtered resources.\n[INFO] skip non existing resourceDirectory /root/ansible_virtualenvs/2.4.0/metron/metron-platform/metron-hbase-client/src/test/resources\n[INFO] \n[INFO] --- maven-compiler-plugin:3.5.1:testCompile (default-testCompile) @ metron-hbase-client ---\n[INFO] \n[INFO] --- jacoco-maven-plugin:0.7.9:prepare-agent (default) @ stellar-common ---\n[INFO] No sources to compile\n[INFO] \n[INFO] --- maven-surefire-plugin:2.18:test (default-test) @ metron-hbase-client ---\n[INFO] argLine set to -javaagent:/root/.m2/repository/org/jacoco/org.jacoco.agent/0.7.9/org.jacoco.agent-0.7.9-runtime.jar=destfile=/root/ansible_virtualenvs/2.4.0/metron/metron-stellar/stellar-common/target/jacoco.exec\n[INFO] \n[INFO] --- antlr4-maven-plugin:4.5:antlr4 (default) @ stellar-common ---\n[INFO] Tests are skipped.\n[INFO] \n[INFO] --- maven-surefire-plugin:2.18:test (unit-tests) @ metron-hbase-client ---\n[INFO] Reading assembly descriptor: src/main/assemblies/metron-mpack.xml\n[INFO] Tests are skipped.\n[INFO] \n[INFO] --- jacoco-maven-plugin:0.7.9:report (report) @ metron-hbase-client ---\n[INFO] Skipping JaCoCo execution due to missing execution data file.\n[INFO] \n[INFO] --- maven-jar-plugin:3.0.2:jar (default-jar) @ metron-hbase-client ---\n[INFO] ANTLR 4: Processing source directory /root/ansible_virtualenvs/2.4.0/metron/metron-stellar/stellar-common/src/main/antlr4\n[INFO] Reading assembly descriptor: src/main/assemblies/elasticsearch-mpack.xml\n[INFO] Building tar: /root/ansible_virtualenvs/2.4.0/metron/metron-deployment/packaging/ambari/elasticsearch-mpack/target/elasticsearch_mpack-0.7.1.0.tar.gz\n[INFO] \n[INFO] ------------------------------------------------------------------------\n[INFO] Building metron-parsing 0.7.1\n[INFO] ------------------------------------------------------------------------\n[INFO] \n[INFO] --- maven-enforcer-plugin:1.4.1:enforce (enforce-versions) @ metron-parsing ---\n[INFO] \n[INFO] --- jacoco-maven-plugin:0.7.9:prepare-agent (default) @ metron-parsing ---\n[INFO] argLine set to -javaagent:/root/.m2/repository/org/jacoco/org.jacoco.agent/0.7.9/org.jacoco.agent-0.7.9-runtime.jar=destfile=/root/ansible_virtualenvs/2.4.0/metron/metron-platform/metron-parsing/target/jacoco.exec\n[INFO] \n[INFO] --- jacoco-maven-plugin:0.7.9:report (report) @ metron-parsing ---\n[INFO] Skipping JaCoCo execution due to missing execution data file.\n[INFO] \n[INFO] ------------------------------------------------------------------------\n[INFO] Building elasticsearch-shaded 0.7.1\n[INFO] ------------------------------------------------------------------------\n[WARNING] JAR will be empty - no content was marked for inclusion!\n[INFO] Building jar: /root/ansible_virtualenvs/2.4.0/metron/metron-platform/metron-hbase-client/target/metron-hbase-client-0.7.1.jar\n[INFO] Processing grammar: org/apache/metron/stellar/common/generated/Stellar.g4\n[INFO] \n[INFO] --- maven-jar-plugin:3.0.2:test-jar (default) @ metron-hbase-client ---\n[WARNING] JAR will be empty - no content was marked for inclusion!\n[INFO] Building jar: /root/ansible_virtualenvs/2.4.0/metron/metron-platform/metron-hbase-client/target/metron-hbase-client-0.7.1-tests.jar\n[INFO] \n[INFO] --- maven-shade-plugin:3.2.0:shade (default) @ metron-hbase-client ---\n[INFO] \n[INFO] --- maven-enforcer-plugin:1.4.1:enforce (enforce-versions) @ elasticsearch-shaded ---\n[INFO] \n[INFO] --- jacoco-maven-plugin:0.7.9:prepare-agent (default) @ elasticsearch-shaded ---\n[INFO] argLine set to -javaagent:/root/.m2/repository/org/jacoco/org.jacoco.agent/0.7.9/org.jacoco.agent-0.7.9-runtime.jar=destfile=/root/ansible_virtualenvs/2.4.0/metron/metron-platform/elasticsearch-shaded/target/jacoco.exec\n[INFO] \n[INFO] --- maven-resources-plugin:2.6:resources (default-resources) @ elasticsearch-shaded ---\n[INFO] Using 'UTF-8' encoding to copy filtered resources.\n[INFO] Copying 2 resources\n[INFO] \n[INFO] --- maven-compiler-plugin:3.5.1:compile (default-compile) @ elasticsearch-shaded ---\n[INFO] Changes detected - recompiling the module!\n[INFO] Compiling 1 source file to /root/ansible_virtualenvs/2.4.0/metron/metron-platform/elasticsearch-shaded/target/classes\n[INFO] Including org.apache.hbase:hbase-shaded-client:jar:1.1.2 in the shaded jar.\n[INFO] Including commons-logging:commons-logging:jar:1.2 in the shaded jar.\n[INFO] Including com.google.code.findbugs:jsr305:jar:1.3.9 in the shaded jar.\n[INFO] Including org.apache.htrace:htrace-core:jar:3.1.0-incubating in the shaded jar.\n[INFO] Including com.github.stephenc.findbugs:findbugs-annotations:jar:1.3.9-1 in the shaded jar.\n[INFO] Including log4j:log4j:jar:1.2.17 in the shaded jar.\n[INFO] Excluding org.slf4j:slf4j-api:jar:1.7.7 from the shaded jar.\n[INFO] Excluding org.slf4j:slf4j-log4j12:jar:1.7.7 from the shaded jar.\n[INFO] Building tar: /root/ansible_virtualenvs/2.4.0/metron/metron-deployment/packaging/ambari/metron-mpack/target/metron_mpack-0.7.1.0.tar.gz\n[INFO] Copying node binary from /root/ansible_virtualenvs/2.4.0/metron/metron-interface/metron-config/node/tmp/node-v9.11.1-linux-x64/bin/node to /root/ansible_virtualenvs/2.4.0/metron/metron-interface/metron-config/node/node\n[INFO] \n[INFO] --- maven-resources-plugin:2.6:testResources (default-testResources) @ elasticsearch-shaded ---\n[INFO] Using 'UTF-8' encoding to copy filtered resources.\n[INFO] skip non existing resourceDirectory /root/ansible_virtualenvs/2.4.0/metron/metron-platform/elasticsearch-shaded/src/test/resources\n[INFO] \n[INFO] --- maven-compiler-plugin:3.5.1:testCompile (default-testCompile) @ elasticsearch-shaded ---\n[INFO] No sources to compile\n[INFO] \n[INFO] --- maven-surefire-plugin:2.18:test (default-test) @ elasticsearch-shaded ---\n[INFO] Tests are skipped.\n[INFO] \n[INFO] --- maven-surefire-plugin:2.18:test (unit-tests) @ elasticsearch-shaded ---\n[INFO] Tests are skipped.\n[INFO] \n[INFO] --- jacoco-maven-plugin:0.7.9:report (report) @ elasticsearch-shaded ---\n[INFO] Skipping JaCoCo execution due to missing execution data file.\n[INFO] \n[INFO] --- maven-jar-plugin:2.4:jar (default-jar) @ elasticsearch-shaded ---\n[INFO] \n[INFO] --- maven-resources-plugin:2.6:testResources (default-testResources) @ metron-zookeeper ---\n[INFO] \n[INFO] --- maven-resources-plugin:2.6:testResources (default-testResources) @ metron-storm-kafka-override ---\n[INFO] Using 'UTF-8' encoding to copy filtered resources.\n[INFO] skip non existing resourceDirectory /root/ansible_virtualenvs/2.4.0/metron/metron-platform/metron-zookeeper/src/test/resources\n[INFO] \n[INFO] --- maven-compiler-plugin:3.5.1:testCompile (default-testCompile) @ metron-zookeeper ---\n[INFO] Using 'UTF-8' encoding to copy filtered resources.\n[INFO] skip non existing resourceDirectory /root/ansible_virtualenvs/2.4.0/metron/metron-platform/metron-storm-kafka-override/src/test/resources\n[INFO] \n[INFO] --- maven-compiler-plugin:3.5.1:testCompile (default-testCompile) @ metron-storm-kafka-override ---\n[INFO] No sources to compile\n[INFO] \n[INFO] --- maven-surefire-plugin:2.18:test (default-test) @ metron-zookeeper ---\n[INFO] Tests are skipped.\n[INFO] \n[INFO] --- maven-surefire-plugin:2.18:test (unit-tests) @ metron-zookeeper ---\n[INFO] Changes detected - recompiling the module!\n[INFO] Compiling 1 source file to /root/ansible_virtualenvs/2.4.0/metron/metron-platform/metron-storm-kafka-override/target/test-classes\n[INFO] Tests are skipped.\n[INFO] \n[INFO] --- jacoco-maven-plugin:0.7.9:report (report) @ metron-zookeeper ---\n[INFO] Skipping JaCoCo execution due to missing execution data file.\n[INFO] \n[INFO] --- maven-jar-plugin:2.4:jar (default-jar) @ metron-zookeeper ---\n[INFO] Building jar: /root/ansible_virtualenvs/2.4.0/metron/metron-platform/elasticsearch-shaded/target/elasticsearch-shaded-0.7.1.jar\n[INFO] Building jar: /root/ansible_virtualenvs/2.4.0/metron/metron-platform/metron-zookeeper/target/metron-zookeeper-0.7.1.jar\n[INFO] \n[INFO] --- maven-shade-plugin:3.2.0:shade (default) @ elasticsearch-shaded ---\n[INFO] Installed node locally.\n[INFO] Installing node version v9.11.1\n[INFO] Unpacking /root/.m2/repository/com/github/eirslett/node/9.11.1/node-9.11.1-linux-x64.tar.gz into /root/ansible_virtualenvs/2.4.0/metron/metron-interface/metron-alerts/node/tmp\n[INFO] Installing npm version 6.2.0\n[INFO] Unpacking /root/.m2/repository/com/github/eirslett/npm/6.2.0/npm-6.2.0.tar.gz into /root/ansible_virtualenvs/2.4.0/metron/metron-interface/metron-config/node/node_modules\n[INFO] \n[INFO] ------------------------------------------------------------------------\n[INFO] Building metron-test-utilities 0.7.1\n[INFO] ------------------------------------------------------------------------\n[INFO] \n[INFO] --- maven-resources-plugin:2.6:resources (default-resources) @ stellar-common ---\n[INFO] Using 'UTF-8' encoding to copy filtered resources.\n[INFO] \n[INFO] --- maven-surefire-plugin:2.18:test (default-test) @ metron-storm-kafka-override ---\n[INFO] Copying 2 resources\n[INFO] \n[INFO] --- maven-compiler-plugin:3.5.1:compile (default-compile) @ stellar-common ---\n[INFO] Including com.google.guava:guava:jar:18.0 in the shaded jar.\n[INFO] Including io.netty:netty-common:jar:4.1.13.Final in the shaded jar.\n[INFO] Including org.elasticsearch.client:elasticsearch-rest-high-level-client:jar:5.6.14 in the shaded jar.\n[INFO] Including org.elasticsearch.client:elasticsearch-rest-client:jar:5.6.14 in the shaded jar.\n[INFO] Including org.apache.httpcomponents:httpclient:jar:4.5.2 in the shaded jar.\n[INFO] Including org.apache.httpcomponents:httpcore:jar:4.4.5 in the shaded jar.\n[INFO] Including org.apache.httpcomponents:httpasyncclient:jar:4.1.2 in the shaded jar.\n[INFO] Including org.apache.httpcomponents:httpcore-nio:jar:4.4.5 in the shaded jar.\n[INFO] Including commons-codec:commons-codec:jar:1.10 in the shaded jar.\n[INFO] Including commons-logging:commons-logging:jar:1.1.3 in the shaded jar.\n[INFO] Including org.elasticsearch.plugin:parent-join-client:jar:5.6.14 in the shaded jar.\n[INFO] Including org.locationtech.spatial4j:spatial4j:jar:0.6 in the shaded jar.\n[INFO] Including com.vividsolutions:jts:jar:1.13 in the shaded jar.\n[INFO] Including org.elasticsearch.plugin:aggs-matrix-stats-client:jar:5.6.14 in the shaded jar.\n[INFO] Including org.apache.logging.log4j:log4j-core:jar:2.8.2 in the shaded jar.\n[INFO] Including org.apache.logging.log4j:log4j-api:jar:2.8.2 in the shaded jar.\n[INFO] Including org.elasticsearch:elasticsearch:jar:5.6.14 in the shaded jar.\n[INFO] Including org.apache.lucene:lucene-core:jar:6.6.1 in the shaded jar.\n[INFO] Including org.apache.lucene:lucene-analyzers-common:jar:6.6.1 in the shaded jar.\n[INFO] Including org.apache.lucene:lucene-backward-codecs:jar:6.6.1 in the shaded jar.\n[INFO] Including org.apache.lucene:lucene-grouping:jar:6.6.1 in the shaded jar.\n[INFO] Including org.apache.lucene:lucene-highlighter:jar:6.6.1 in the shaded jar.\n[INFO] Including org.apache.lucene:lucene-join:jar:6.6.1 in the shaded jar.\n[INFO] Including org.apache.lucene:lucene-memory:jar:6.6.1 in the shaded jar.\n[INFO] Including org.apache.lucene:lucene-misc:jar:6.6.1 in the shaded jar.\n[INFO] Including org.apache.lucene:lucene-queries:jar:6.6.1 in the shaded jar.\n[INFO] Including org.apache.lucene:lucene-queryparser:jar:6.6.1 in the shaded jar.\n[INFO] Including org.apache.lucene:lucene-sandbox:jar:6.6.1 in the shaded jar.\n[INFO] Including org.apache.lucene:lucene-spatial:jar:6.6.1 in the shaded jar.\n[INFO] Including org.apache.lucene:lucene-spatial-extras:jar:6.6.1 in the shaded jar.\n[INFO] Including org.apache.lucene:lucene-spatial3d:jar:6.6.1 in the shaded jar.\n[INFO] Including org.apache.lucene:lucene-suggest:jar:6.6.1 in the shaded jar.\n[INFO] Including org.elasticsearch:securesm:jar:1.2 in the shaded jar.\n[INFO] Including net.sf.jopt-simple:jopt-simple:jar:5.0.2 in the shaded jar.\n[INFO] Including com.carrotsearch:hppc:jar:0.7.1 in the shaded jar.\n[INFO] Including joda-time:joda-time:jar:2.10 in the shaded jar.\n[INFO] Including org.yaml:snakeyaml:jar:1.15 in the shaded jar.\n[INFO] Including com.tdunning:t-digest:jar:3.0 in the shaded jar.\n[INFO] Including org.hdrhistogram:HdrHistogram:jar:2.1.9 in the shaded jar.\n[INFO] Including org.elasticsearch:jna:jar:4.4.0-1 in the shaded jar.\n[INFO] Including com.fasterxml.jackson.core:jackson-core:jar:2.7.4 in the shaded jar.\n[INFO] Including com.fasterxml.jackson.dataformat:jackson-dataformat-smile:jar:2.7.4 in the shaded jar.\n[INFO] Including com.fasterxml.jackson.dataformat:jackson-dataformat-yaml:jar:2.7.4 in the shaded jar.\n[INFO] Including com.fasterxml.jackson.dataformat:jackson-dataformat-cbor:jar:2.7.4 in the shaded jar.\n[INFO] Including org.slf4j:slf4j-api:jar:1.7.7 in the shaded jar.\n[INFO] Excluding org.slf4j:slf4j-log4j12:jar:1.7.7 from the shaded jar.\n[INFO] Including log4j:log4j:jar:1.2.17 in the shaded jar.\n[INFO] Tests are skipped.\n[INFO] \n[INFO] --- maven-surefire-plugin:2.18:test (unit-tests) @ metron-storm-kafka-override ---\n[INFO] Tests are skipped.\n[INFO] \n[INFO] --- jacoco-maven-plugin:0.7.9:report (report) @ metron-storm-kafka-override ---\n[INFO] Changes detected - recompiling the module!\n[INFO] Compiling 113 source files to /root/ansible_virtualenvs/2.4.0/metron/metron-stellar/stellar-common/target/classes\n[INFO] Skipping JaCoCo execution due to missing execution data file.\n[INFO] \n[INFO] --- maven-jar-plugin:2.4:jar (default-jar) @ metron-storm-kafka-override ---\n[INFO] Building jar: /root/ansible_virtualenvs/2.4.0/metron/metron-platform/metron-storm-kafka-override/target/metron-storm-kafka-override-0.7.1.jar\n[INFO] \n[INFO] --- maven-shade-plugin:3.2.0:shade (default) @ metron-storm-kafka-override ---\n[INFO] \n[INFO] --- maven-enforcer-plugin:1.4.1:enforce (enforce-versions) @ metron-test-utilities ---\n[INFO] \n[INFO] --- jacoco-maven-plugin:0.7.9:prepare-agent (default) @ metron-test-utilities ---\n[INFO] argLine set to -javaagent:/root/.m2/repository/org/jacoco/org.jacoco.agent/0.7.9/org.jacoco.agent-0.7.9-runtime.jar=destfile=/root/ansible_virtualenvs/2.4.0/metron/metron-platform/metron-test-utilities/target/jacoco.exec\n[INFO] \n[INFO] --- maven-resources-plugin:2.6:resources (default-resources) @ metron-test-utilities ---\n[INFO] Using 'UTF-8' encoding to copy filtered resources.\n[INFO] skip non existing resourceDirectory /root/ansible_virtualenvs/2.4.0/metron/metron-platform/metron-test-utilities/src/main/resources\n[INFO] \n[INFO] --- maven-compiler-plugin:3.5.1:compile (default-compile) @ metron-test-utilities ---\n[INFO] Changes detected - recompiling the module!\n[INFO] Compiling 15 source files to /root/ansible_virtualenvs/2.4.0/metron/metron-platform/metron-test-utilities/target/classes\n[INFO] Including com.google.guava:guava:jar:16.0.1 in the shaded jar.\n[INFO] Including org.apache.storm:storm-kafka-client:jar:1.2.2 in the shaded jar.\n[INFO] Including commons-lang:commons-lang:jar:2.5 in the shaded jar.\n[INFO] Including com.fasterxml.jackson.core:jackson-databind:jar:2.9.4 in the shaded jar.\n[INFO] Including com.fasterxml.jackson.core:jackson-annotations:jar:2.9.0 in the shaded jar.\n[INFO] Including com.fasterxml.jackson.core:jackson-core:jar:2.9.4 in the shaded jar.\n[INFO] Including org.apache.kafka:kafka-clients:jar:0.10.0.2.5.0.0-1245 in the shaded jar.\n[INFO] Including net.jpountz.lz4:lz4:jar:1.3.0 in the shaded jar.\n[INFO] Including org.xerial.snappy:snappy-java:jar:1.1.2.6 in the shaded jar.\n[INFO] Including org.slf4j:slf4j-api:jar:1.7.7 in the shaded jar.\n[INFO] Excluding org.slf4j:slf4j-log4j12:jar:1.7.7 from the shaded jar.\n[INFO] Including log4j:log4j:jar:1.2.17 in the shaded jar.\n[INFO] Installed npm locally.\n[INFO] \n[INFO] --- frontend-maven-plugin:1.3:npm (npm ci) @ metron-config ---\n[INFO] npm not inheriting proxy config from Maven\n[INFO] Running 'npm ci' in /root/ansible_virtualenvs/2.4.0/metron/metron-interface/metron-config\n[INFO] Copying node binary from /root/ansible_virtualenvs/2.4.0/metron/metron-interface/metron-alerts/node/tmp/node-v9.11.1-linux-x64/bin/node to /root/ansible_virtualenvs/2.4.0/metron/metron-interface/metron-alerts/node/node\n[INFO] \n[INFO] --- maven-resources-plugin:2.6:testResources (default-testResources) @ metron-test-utilities ---\n[INFO] Using 'UTF-8' encoding to copy filtered resources.\n[INFO] skip non existing resourceDirectory /root/ansible_virtualenvs/2.4.0/metron/metron-platform/metron-test-utilities/src/test/resources\n[INFO] \n[INFO] --- maven-compiler-plugin:3.5.1:testCompile (default-testCompile) @ metron-test-utilities ---\n[INFO] No sources to compile\n[INFO] \n[INFO] --- maven-surefire-plugin:2.18:test (default-test) @ metron-test-utilities ---\n[INFO] Tests are skipped.\n[INFO] \n[INFO] --- maven-surefire-plugin:2.18:test (unit-tests) @ metron-test-utilities ---\n[INFO] Tests are skipped.\n[INFO] \n[INFO] --- jacoco-maven-plugin:0.7.9:report (report) @ metron-test-utilities ---\n[INFO] Skipping JaCoCo execution due to missing execution data file.\n[INFO] \n[INFO] --- maven-jar-plugin:2.4:jar (default-jar) @ metron-test-utilities ---\n[INFO] Building jar: /root/ansible_virtualenvs/2.4.0/metron/metron-platform/metron-test-utilities/target/metron-test-utilities-0.7.1.jar\n[INFO] Installed node locally.\n[INFO] Installing npm version 6.2.0\n[INFO] Unpacking /root/.m2/repository/com/github/eirslett/npm/6.2.0/npm-6.2.0.tar.gz into /root/ansible_virtualenvs/2.4.0/metron/metron-interface/metron-alerts/node/node_modules\n[INFO] Installed npm locally.\n[INFO] \n[INFO] --- frontend-maven-plugin:1.3:npm (npm ci) @ metron-alerts ---\n[INFO] npm not inheriting proxy config from Maven\n[INFO] Running 'npm ci' in /root/ansible_virtualenvs/2.4.0/metron/metron-interface/metron-alerts\n[WARNING] metron-storm-kafka-override-0.7.1.jar, storm-kafka-client-1.2.2.jar define 6 overlapping classes: \n[WARNING] - org.apache.storm.kafka.spout.KafkaSpoutRetryExponentialBackoff\n[WARNING] - org.apache.storm.kafka.spout.internal.Timer\n[WARNING] - org.apache.storm.kafka.spout.KafkaSpoutRetryExponentialBackoff$RetrySchedule\n[WARNING] - org.apache.storm.kafka.spout.KafkaSpoutRetryExponentialBackoff$RetryEntryTimeStampComparator\n[WARNING] - org.apache.storm.kafka.spout.KafkaSpoutRetryExponentialBackoff$TimeInterval\n[WARNING] - org.apache.storm.kafka.spout.KafkaSpoutRetryExponentialBackoff$1\n[WARNING] maven-shade-plugin has detected that some class files are\n[WARNING] present in two or more JARs. When this happens, only one\n[WARNING] single version of the class is copied to the uber jar.\n[WARNING] Usually this is not harmful and you can skip these warnings,\n[WARNING] otherwise try to manually exclude artifacts based on\n[WARNING] mvn dependency:tree -Ddetail=true and the above output.\n[WARNING] See http://maven.apache.org/plugins/maven-shade-plugin/\n[INFO] Replacing original artifact with shaded artifact.\n[INFO] Replacing /root/ansible_virtualenvs/2.4.0/metron/metron-platform/metron-storm-kafka-override/target/metron-storm-kafka-override-0.7.1.jar with /root/ansible_virtualenvs/2.4.0/metron/metron-platform/metron-storm-kafka-override/target/metron-storm-kafka-override-0.7.1-shaded.jar\n[INFO] Dependency-reduced POM written at: /root/ansible_virtualenvs/2.4.0/metron/metron-platform/metron-storm-kafka-override/dependency-reduced-pom.xml\n[INFO] \n[INFO] --- maven-resources-plugin:2.6:testResources (default-testResources) @ stellar-common ---\n[INFO] Using 'UTF-8' encoding to copy filtered resources.\n[INFO] Copying 2 resources\n[INFO] \n[INFO] --- maven-compiler-plugin:3.5.1:testCompile (default-testCompile) @ stellar-common ---\n[INFO] Changes detected - recompiling the module!\n[INFO] Compiling 60 source files to /root/ansible_virtualenvs/2.4.0/metron/metron-stellar/stellar-common/target/test-classes\n[INFO] \n[INFO] > fsevents@1.2.4 install /root/ansible_virtualenvs/2.4.0/metron/metron-interface/metron-config/node_modules/fsevents\n[INFO] > node install\n[INFO] \n[ERROR] internal/modules/cjs/loader.js:584\n[ERROR] throw err;\n[ERROR] ^\n[ERROR] \n[ERROR] Error: Cannot find module '/root/ansible_virtualenvs/2.4.0/metron/metron-interface/metron-config/node_modules/fsevents/install'\n[ERROR] at Function.Module._resolveFilename (internal/modules/cjs/loader.js:582:15)\n[ERROR] at Function.Module._load (internal/modules/cjs/loader.js:508:25)\n[ERROR] at Function.Module.runMain (internal/modules/cjs/loader.js:754:12)\n[ERROR] at startup (internal/bootstrap/node.js:283:19)\n[ERROR] at bootstrapNodeJSCore (internal/bootstrap/node.js:622:3)\n[INFO] \n[INFO] > node-sass@4.9.3 install /root/ansible_virtualenvs/2.4.0/metron/metron-interface/metron-config/node_modules/node-sass\n[INFO] > node scripts/install.js\n[INFO] \n[ERROR] internal/modules/cjs/loader.js:584\n[ERROR] throw err;\n[ERROR] ^\n[ERROR] \n[ERROR] Error: Cannot find module '/root/ansible_virtualenvs/2.4.0/metron/metron-interface/metron-config/node_modules/node-sass/scripts/install.js'\n[ERROR] at Function.Module._resolveFilename (internal/modules/cjs/loader.js:582:15)\n[ERROR] at Function.Module._load (internal/modules/cjs/loader.js:508:25)\n[ERROR] at Function.Module.runMain (internal/modules/cjs/loader.js:754:12)\n[ERROR] at startup (internal/bootstrap/node.js:283:19)\n[ERROR] at bootstrapNodeJSCore (internal/bootstrap/node.js:622:3)\n[INFO] \n[INFO] > puppeteer@1.8.0 install /root/ansible_virtualenvs/2.4.0/metron/metron-interface/metron-config/node_modules/puppeteer\n[INFO] > node install.js\n[INFO] \n[ERROR] internal/modules/cjs/loader.js:584\n[ERROR] throw err;\n[ERROR] ^\n[ERROR] \n[ERROR] Error: Cannot find module '/root/ansible_virtualenvs/2.4.0/metron/metron-interface/metron-config/node_modules/puppeteer/install.js'\n[ERROR] at Function.Module._resolveFilename (internal/modules/cjs/loader.js:582:15)\n[ERROR] at Function.Module._load (internal/modules/cjs/loader.js:508:25)\n[ERROR] at Function.Module.runMain (internal/modules/cjs/loader.js:754:12)\n[ERROR] at startup (internal/bootstrap/node.js:283:19)\n[ERROR] at bootstrapNodeJSCore (internal/bootstrap/node.js:622:3)\n[ERROR] npm ERR! code ELIFECYCLE\n[ERROR] npm ERR! errno 1\n[ERROR] npm ERR! puppeteer@1.8.0 install: `node install.js`\n[ERROR] npm ERR! Exit status 1\n[ERROR] npm ERR! \n[ERROR] npm ERR! Failed at the puppeteer@1.8.0 install script.\n[ERROR] npm ERR! This is probably not a problem with npm. There is likely additional logging output above.\n[ERROR] \n[ERROR] npm ERR! A complete log of this run can be found in:\n[ERROR] npm ERR! /root/.npm/_logs/2019-04-12T04_06_20_985Z-debug.log\n[INFO] ------------------------------------------------------------------------\n[INFO] Reactor Summary:\n[INFO] \n[INFO] Metron ............................................. SUCCESS [ 0.596 s]\n[INFO] metron-stellar ..................................... SUCCESS [ 0.074 s]\n[INFO] stellar-common ..................................... SKIPPED\n[INFO] metron-analytics ................................... SUCCESS [ 0.069 s]\n[INFO] metron-maas-common ................................. SKIPPED\n[INFO] metron-platform .................................... SUCCESS [ 0.708 s]\n[INFO] metron-zookeeper ................................... SUCCESS [ 2.909 s]\n[INFO] metron-test-utilities .............................. SUCCESS [ 2.760 s]\n[INFO] metron-integration-test ............................ SKIPPED\n[INFO] metron-maas-service ................................ SKIPPED\n[INFO] metron-common ...................................... SKIPPED\n[INFO] metron-statistics .................................. SKIPPED\n[INFO] metron-hbase ....................................... SKIPPED\n[INFO] metron-enrichment .................................. SKIPPED\n[INFO] metron-enrichment-common ........................... SKIPPED\n[INFO] metron-writer ...................................... SKIPPED\n[INFO] metron-storm-kafka-override ........................ SUCCESS [ 10.582 s]\n[INFO] metron-storm-kafka ................................. SKIPPED\n[INFO] metron-profiler-common ............................. SKIPPED\n[INFO] metron-profiler-client ............................. SKIPPED\n[INFO] metron-profiler-storm .............................. SKIPPED\n[INFO] metron-profiler-spark .............................. SKIPPED\n[INFO] metron-profiler-repl ............................... SKIPPED\n[INFO] metron-hbase-client ................................ SKIPPED\n[INFO] metron-enrichment-storm ............................ SKIPPED\n[INFO] metron-indexing .................................... SKIPPED\n[INFO] metron-solr ........................................ SKIPPED\n[INFO] metron-job ......................................... SKIPPED\n[INFO] metron-pcap ........................................ SKIPPED\n[INFO] metron-pcap-backend ................................ SKIPPED\n[INFO] metron-data-management ............................. SKIPPED\n[INFO] metron-parsing ..................................... SUCCESS [ 0.024 s]\n[INFO] metron-parsers-common .............................. SKIPPED\n[INFO] metron-parsers ..................................... SKIPPED\n[INFO] metron-management .................................. SKIPPED\n[INFO] elasticsearch-shaded ............................... SKIPPED\n[INFO] metron-elasticsearch ............................... SKIPPED\n[INFO] metron-parsing-storm ............................... SKIPPED\n[INFO] metron-deployment .................................. SUCCESS [ 0.003 s]\n[INFO] Elasticsearch Ambari Management Pack ............... SUCCESS [ 2.263 s]\n[INFO] Metron Ambari Management Pack ...................... SUCCESS [ 3.230 s]\n[INFO] metron-contrib ..................................... SUCCESS [ 0.031 s]\n[INFO] metron-docker ...................................... SUCCESS [ 1.342 s]\n[INFO] metron-performance ................................. SKIPPED\n[INFO] metron-interface ................................... SUCCESS [ 0.037 s]\n[INFO] metron-config ...................................... FAILURE [ 25.043 s]\n[INFO] metron-alerts ...................................... SKIPPED\n[INFO] metron-rest-client ................................. SKIPPED\n[INFO] metron-rest ........................................ SKIPPED\n[INFO] site-book .......................................... SUCCESS [ 1.127 s]\n[INFO] 3rd party Functions (just for tests) ............... SKIPPED\n[INFO] stellar-zeppelin ................................... SKIPPED\n[INFO] ------------------------------------------------------------------------\n[INFO] BUILD FAILURE\n[INFO] ------------------------------------------------------------------------\n[INFO] Total time: 26.187 s (Wall Clock)\n[INFO] Finished at: 2019-04-12T12:06:23+08:00\n[INFO] Final Memory: 595M/804M\n[INFO] ------------------------------------------------------------------------\n[ERROR] Failed to execute goal com.github.eirslett:frontend-maven-plugin:1.3:npm (npm ci) on project metron-config: Failed to run task: 'npm ci' failed. (error code 1) -> [Help 1]\n[ERROR] \n[ERROR] To see the full stack trace of the errors, re-run Maven with the -e switch.\n[ERROR] Re-run Maven using the -X switch to enable full debug logging.\n[ERROR] \n[ERROR] For more information about the errors and possible solutions, please read the following articles:\n[ERROR] [Help 1] http://cwiki.apache.org/confluence/display/MAVEN/MojoFailureException\n[ERROR] \n[ERROR] After correcting the problems, you can resume the build with the command\n[ERROR] mvn <goals> -rf :metron-config",

"stdout_lines": [

"[INFO] Scanning for projects...",

"[WARNING] ",

"[WARNING] Some problems were encountered while building the effective model for org.apache.metron:metron-profiler-storm:jar:0.7.1",

"[WARNING] 'dependencies.dependency.(groupId:artifactId:type:classifier)' must be unique: org.apache.metron:metron-integration-test:jar -> duplicate declaration of version ${project.parent.version} @ org.apache.metron:metron-profiler-storm:[unknown-version], /root/ansible_virtualenvs/2.4.0/metron/metron-analytics/metron-profiler-storm/pom.xml, line 314, column 21",

"[WARNING] ",

"[WARNING] Some problems were encountered while building the effective model for org.apache.metron:metron-writer:jar:0.7.1",

"[WARNING] 'dependencies.dependency.(groupId:artifactId:type:classifier)' must be unique: org.apache.httpcomponents:httpclient:jar -> duplicate declaration of version ${global_httpclient_version} @ org.apache.metron:metron-writer:[unknown-version], /root/ansible_virtualenvs/2.4.0/metron/metron-platform/metron-writer/pom.xml, line 248, column 21",

"[WARNING] ",

"[WARNING] It is highly recommended to fix these problems because they threaten the stability of your build.",

"[WARNING] ",

"[WARNING] For this reason, future Maven versions might no longer support building such malformed projects.",

"[WARNING] ",

"[INFO] ------------------------------------------------------------------------",

"[INFO] Reactor Build Order:",

"[INFO] ",

"[INFO] Metron",

"[INFO] metron-stellar",

"[INFO] stellar-common",

"[INFO] metron-analytics",

"[INFO] metron-maas-common",

"[INFO] metron-platform",

"[INFO] metron-zookeeper",

"[INFO] metron-test-utilities",

"[INFO] metron-integration-test",

"[INFO] metron-maas-service",

"[INFO] metron-common",

"[INFO] metron-statistics",

"[INFO] metron-hbase",

"[INFO] metron-enrichment",

"[INFO] metron-enrichment-common",

"[INFO] metron-writer",

"[INFO] metron-storm-kafka-override",

"[INFO] metron-storm-kafka",

"[INFO] metron-profiler-common",

"[INFO] metron-profiler-client",

"[INFO] metron-profiler-storm",

"[INFO] metron-profiler-spark",

"[INFO] metron-profiler-repl",

"[INFO] metron-hbase-client",

"[INFO] metron-enrichment-storm",

"[INFO] metron-indexing",

"[INFO] metron-solr",

"[INFO] metron-job",

"[INFO] metron-pcap",

"[INFO] metron-pcap-backend",

"[INFO] metron-data-management",

"[INFO] metron-parsing",

"[INFO] metron-parsers-common",

"[INFO] metron-parsers",

"[INFO] metron-management",

"[INFO] elasticsearch-shaded",

"[INFO] metron-elasticsearch",

"[INFO] metron-parsing-storm",

"[INFO] metron-deployment",

"[INFO] Elasticsearch Ambari Management Pack",

"[INFO] Metron Ambari Management Pack",

"[INFO] metron-contrib",

"[INFO] metron-docker",

"[INFO] metron-performance",

"[INFO] metron-interface",

"[INFO] metron-config",

"[INFO] metron-alerts",

"[INFO] metron-rest-client",

"[INFO] metron-rest",

"[INFO] site-book",

"[INFO] 3rd party Functions (just for tests)",

"[INFO] stellar-zeppelin",

"[INFO] ",

"[INFO] Using the MultiThreadedBuilder implementation with a thread count of 8",

"[INFO] ",

"[INFO] ------------------------------------------------------------------------",

"[INFO] Building Metron 0.7.1",

"[INFO] ------------------------------------------------------------------------",

"[INFO] ",

"[INFO] --- maven-enforcer-plugin:1.4.1:enforce (enforce-versions) @ Metron ---",

"[INFO] ",

"[INFO] --- jacoco-maven-plugin:0.7.9:prepare-agent (default) @ Metron ---",

"[INFO] argLine set to -javaagent:/root/.m2/repository/org/jacoco/org.jacoco.agent/0.7.9/org.jacoco.agent-0.7.9-runtime.jar=destfile=/root/ansible_virtualenvs/2.4.0/metron/target/jacoco.exec",

"[INFO] ",

"[INFO] --- jacoco-maven-plugin:0.7.9:report (report) @ Metron ---",

"[INFO] Skipping JaCoCo execution due to missing execution data file.",

"[INFO] ",

"[INFO] ------------------------------------------------------------------------",

"[INFO] Building metron-stellar 0.7.1",

"[INFO] ------------------------------------------------------------------------",

"[INFO] ",

"[INFO] ------------------------------------------------------------------------",

"[INFO] Building metron-analytics 0.7.1",

"[INFO] ------------------------------------------------------------------------",

"[INFO] ",

"[INFO] ------------------------------------------------------------------------",

"[INFO] Building metron-platform 0.7.1",

"[INFO] ------------------------------------------------------------------------",

"[INFO] ",

"[INFO] ------------------------------------------------------------------------",

"[INFO] Building metron-deployment 0.7.1",

"[INFO] ------------------------------------------------------------------------",

"[INFO] ",

"[INFO] --- maven-enforcer-plugin:1.4.1:enforce (enforce-versions) @ metron-deployment ---",

"[INFO] ",

"[INFO] --- jacoco-maven-plugin:0.7.9:prepare-agent (default) @ metron-deployment ---",

"[INFO] argLine set to -javaagent:/root/.m2/repository/org/jacoco/org.jacoco.agent/0.7.9/org.jacoco.agent-0.7.9-runtime.jar=destfile=/root/ansible_virtualenvs/2.4.0/metron/metron-deployment/target/jacoco.exec",

"[INFO] ",

"[INFO] --- jacoco-maven-plugin:0.7.9:report (report) @ metron-deployment ---",

"[INFO] Skipping JaCoCo execution due to missing execution data file.",

"[INFO] ",

"[INFO] ------------------------------------------------------------------------",

"[INFO] Building metron-contrib 0.7.1",

"[INFO] ------------------------------------------------------------------------",

"[INFO] ",

"[INFO] ------------------------------------------------------------------------",

"[INFO] Building metron-interface 0.7.1",

"[INFO] ------------------------------------------------------------------------",

"[INFO] ",

"[INFO] --- maven-enforcer-plugin:1.4.1:enforce (enforce-versions) @ metron-contrib ---",

"[INFO] ",

"[INFO] --- jacoco-maven-plugin:0.7.9:prepare-agent (default) @ metron-contrib ---",

"[INFO] argLine set to -javaagent:/root/.m2/repository/org/jacoco/org.jacoco.agent/0.7.9/org.jacoco.agent-0.7.9-runtime.jar=destfile=/root/ansible_virtualenvs/2.4.0/metron/metron-contrib/target/jacoco.exec",

"[INFO] ",

"[INFO] --- maven-enforcer-plugin:1.4.1:enforce (enforce-versions) @ metron-interface ---",

"[INFO] ",

"[INFO] --- maven-enforcer-plugin:1.4.1:enforce (enforce-versions) @ metron-analytics ---",

"[INFO] ",

"[INFO] --- jacoco-maven-plugin:0.7.9:prepare-agent (default) @ metron-analytics ---",

"[INFO] ",

"[INFO] ------------------------------------------------------------------------",

"[INFO] Building site-book 0.7.1",

"[INFO] ------------------------------------------------------------------------",

"[INFO] argLine set to -javaagent:/root/.m2/repository/org/jacoco/org.jacoco.agent/0.7.9/org.jacoco.agent-0.7.9-runtime.jar=destfile=/root/ansible_virtualenvs/2.4.0/metron/metron-analytics/target/jacoco.exec",

"[INFO] ",

"[INFO] --- jacoco-maven-plugin:0.7.9:report (report) @ metron-analytics ---",

"[INFO] ",

"[INFO] ",

"[INFO] ",

"[INFO] ------------------------------------------------------------------------",

"[INFO] Building Metron Ambari Management Pack 0.7.1.0",

"[INFO] ------------------------------------------------------------------------",

"[INFO] ",

"[INFO] --- jacoco-maven-plugin:0.7.9:prepare-agent (default) @ metron-interface ---",

"[INFO] ------------------------------------------------------------------------",

"[INFO] Building Elasticsearch Ambari Management Pack 0.7.1.0",

"[INFO] ------------------------------------------------------------------------",

"[INFO] --- jacoco-maven-plugin:0.7.9:report (report) @ metron-contrib ---",

"[INFO] ",

"[INFO] --- maven-enforcer-plugin:1.4.1:enforce (enforce-versions) @ metron-platform ---",

"[INFO] ",

"[INFO] --- maven-enforcer-plugin:1.4.1:enforce (enforce-versions) @ metron-stellar ---",

"[INFO] ",

"[INFO] --- jacoco-maven-plugin:0.7.9:prepare-agent (default) @ metron-stellar ---",

"[INFO] ",

"[INFO] --- jacoco-maven-plugin:0.7.9:prepare-agent (default) @ metron-platform ---",

"[INFO] Skipping JaCoCo execution due to missing execution data file.",

"[INFO] ",

"[INFO] ------------------------------------------------------------------------",

"[INFO] Building metron-docker 0.7.1",

"[INFO] ------------------------------------------------------------------------",

"[INFO] argLine set to -javaagent:/root/.m2/repository/org/jacoco/org.jacoco.agent/0.7.9/org.jacoco.agent-0.7.9-runtime.jar=destfile=/root/ansible_virtualenvs/2.4.0/metron/metron-stellar/target/jacoco.exec",

"[INFO] ",

"[INFO] --- jacoco-maven-plugin:0.7.9:report (report) @ metron-stellar ---",

"[INFO] ",

"[INFO] --- maven-enforcer-plugin:1.4.1:enforce (enforce-versions) @ site-book ---",

"[INFO] argLine set to -javaagent:/root/.m2/repository/org/jacoco/org.jacoco.agent/0.7.9/org.jacoco.agent-0.7.9-runtime.jar=destfile=/root/ansible_virtualenvs/2.4.0/metron/metron-interface/target/jacoco.exec",

"[INFO] ",

"[INFO] --- jacoco-maven-plugin:0.7.9:report (report) @ metron-interface ---",

"[INFO] Skipping JaCoCo execution due to missing execution data file.",

"[INFO] ",

"[INFO] ------------------------------------------------------------------------",

"[INFO] Building metron-config 0.7.1",

"[INFO] ------------------------------------------------------------------------",

"[INFO] Skipping JaCoCo execution due to missing execution data file.",

"[INFO] ",

"[INFO] ------------------------------------------------------------------------",

"[INFO] Building metron-alerts 0.7.1",

"[INFO] ------------------------------------------------------------------------",

"[INFO] Skipping JaCoCo execution due to missing execution data file.",

"[INFO] ",

"[INFO] --- jacoco-maven-plugin:0.7.9:prepare-agent (default) @ site-book ---",

"[INFO] ",

"[INFO] ------------------------------------------------------------------------",

"[INFO] Building stellar-common 0.7.1",

"[INFO] ------------------------------------------------------------------------",

"[INFO] argLine set to -javaagent:/root/.m2/repository/org/jacoco/org.jacoco.agent/0.7.9/org.jacoco.agent-0.7.9-runtime.jar=destfile=/root/ansible_virtualenvs/2.4.0/metron/site-book/target/jacoco.exec",

"[INFO] argLine set to -javaagent:/root/.m2/repository/org/jacoco/org.jacoco.agent/0.7.9/org.jacoco.agent-0.7.9-runtime.jar=destfile=/root/ansible_virtualenvs/2.4.0/metron/metron-platform/target/jacoco.exec",

"[INFO] ",

"[INFO] --- maven-site-plugin:3.7:site (default) @ site-book ---",

"[INFO] ",

"[INFO] --- jacoco-maven-plugin:0.7.9:report (report) @ metron-platform ---",

"[INFO] ",

"[INFO] --- maven-enforcer-plugin:1.4.1:enforce (enforce-versions) @ metron_mpack ---",

"[INFO] Skipping JaCoCo execution due to missing execution data file.",

"[INFO] ",

"[INFO] ------------------------------------------------------------------------",

"[INFO] Building metron-zookeeper 0.7.1",

"[INFO] ------------------------------------------------------------------------",

"[INFO] ",

"[INFO] --- maven-enforcer-plugin:1.4.1:enforce (enforce-versions) @ elasticsearch_mpack ---",

"[INFO] ",

"[INFO] --- maven-enforcer-plugin:1.4.1:enforce (enforce-versions) @ metron-docker ---",

"[INFO] ",

"[INFO] --- build-helper-maven-plugin:1.8:parse-version (parse-version) @ metron_mpack ---",

"[INFO] ",

"[INFO] --- jacoco-maven-plugin:0.7.9:prepare-agent (default) @ metron-docker ---",

"[INFO] ",

"[INFO] --- jacoco-maven-plugin:0.7.9:prepare-agent (default) @ elasticsearch_mpack ---",

"[INFO] ",

"[INFO] --- maven-enforcer-plugin:1.4.1:enforce (enforce-versions) @ metron-alerts ---",

"[INFO] ",

"[INFO] --- maven-enforcer-plugin:1.4.1:enforce (enforce-versions) @ metron-zookeeper ---",

"[INFO] ",

"[INFO] --- jacoco-maven-plugin:0.7.9:prepare-agent (default) @ metron-zookeeper ---",

"[INFO] argLine set to -javaagent:/root/.m2/repository/org/jacoco/org.jacoco.agent/0.7.9/org.jacoco.agent-0.7.9-runtime.jar=destfile=/root/ansible_virtualenvs/2.4.0/metron/metron-platform/metron-zookeeper/target/jacoco.exec",

"[INFO] ",

"[INFO] --- maven-resources-plugin:2.6:resources (default-resources) @ metron-zookeeper ---",

"[INFO] ",

"[INFO] --- build-helper-maven-plugin:1.8:regex-property (metron-version) @ metron_mpack ---",

"[INFO] argLine set to -javaagent:/root/.m2/repository/org/jacoco/org.jacoco.agent/0.7.9/org.jacoco.agent-0.7.9-runtime.jar=destfile=/root/ansible_virtualenvs/2.4.0/metron/metron-deployment/packaging/ambari/elasticsearch-mpack/target/jacoco.exec",

"[INFO] ",

"[INFO] --- maven-resources-plugin:2.6:resources (default-resources) @ elasticsearch_mpack ---",

"[INFO] argLine set to -javaagent:/root/.m2/repository/org/jacoco/org.jacoco.agent/0.7.9/org.jacoco.agent-0.7.9-runtime.jar=destfile=/root/ansible_virtualenvs/2.4.0/metron/metron-contrib/metron-docker/target/jacoco.exec",

"[INFO] ",

"[INFO] --- jacoco-maven-plugin:0.7.9:report (report) @ metron-docker ---",

"[INFO] Skipping JaCoCo execution due to missing execution data file.",

"[INFO] ",

"[INFO] --- maven-resources-plugin:3.0.1:copy-resources (copy-common-to-kafkazk) @ metron-docker ---",

"[INFO] ",

"[INFO] --- maven-enforcer-plugin:1.4.1:enforce (enforce-versions) @ metron-config ---",

"[INFO] ",

"[INFO] --- jacoco-maven-plugin:0.7.9:prepare-agent (default) @ metron-alerts ---",

"[INFO] Using 'UTF-8' encoding to copy filtered resources.",

"[INFO] Using 'UTF-8' encoding to copy filtered resources.",

"[INFO] skip non existing resourceDirectory /root/ansible_virtualenvs/2.4.0/metron/metron-platform/metron-zookeeper/src/main/resources",

"[INFO] ",

"[INFO] --- maven-compiler-plugin:3.5.1:compile (default-compile) @ metron-zookeeper ---",

"[INFO] Copying 31 resources",

"[INFO] ",

"[INFO] --- maven-compiler-plugin:3.5.1:compile (default-compile) @ elasticsearch_mpack ---",

"[INFO] No match to regex '-SNAPSHOT' found in '0.7.1'. The initial value '0.7.1' is left as-is...",

"[INFO] ",

"[INFO] --- build-helper-maven-plugin:1.8:regex-property (metron-short-version) @ metron_mpack ---",

"[INFO] Using 'UTF-8' encoding to copy filtered resources.",

"[INFO] skip non existing resourceDirectory /root/ansible_virtualenvs/2.4.0/metron/metron-platform/metron-common/target",

"[INFO] ",

"[INFO] --- maven-resources-plugin:3.0.1:copy-resources (copy-parsers-to-kafkazk) @ metron-docker ---",

"[INFO] Relativizing decoration links with respect to localized project URL: https://metron.apache.org/",

"[INFO] Rendering site with org.apache.maven.skins:maven-default-skin:jar:1.2 skin.",

"[INFO] ",

"[INFO] --- jacoco-maven-plugin:0.7.9:report (report) @ site-book ---",

"[INFO] argLine set to -javaagent:/root/.m2/repository/org/jacoco/org.jacoco.agent/0.7.9/org.jacoco.agent-0.7.9-runtime.jar=destfile=/root/ansible_virtualenvs/2.4.0/metron/metron-interface/metron-alerts/target/jacoco.exec",

"[INFO] ",

"[INFO] --- frontend-maven-plugin:1.3:install-node-and-npm (install node and npm) @ metron-alerts ---",

"[INFO] No sources to compile",

"[INFO] ",

"[INFO] --- maven-resources-plugin:2.6:copy-resources (copy-resources) @ elasticsearch_mpack ---",

"[INFO] Changes detected - recompiling the module!",

"[INFO] Compiling 2 source files to /root/ansible_virtualenvs/2.4.0/metron/metron-platform/metron-zookeeper/target/classes",

"[INFO] Using 'UTF-8' encoding to copy filtered resources.",

"[INFO] skip non existing resourceDirectory /root/ansible_virtualenvs/2.4.0/metron/metron-platform/metron-parsing/metron-parsers-common/target",

"[INFO] ",

"[INFO] --- maven-resources-plugin:3.0.1:copy-resources (copy-enrichment-to-kafkazk) @ metron-docker ---",

"[INFO] ",

"[INFO] --- jacoco-maven-plugin:0.7.9:prepare-agent (default) @ metron-config ---",

"[INFO] argLine set to -javaagent:/root/.m2/repository/org/jacoco/org.jacoco.agent/0.7.9/org.jacoco.agent-0.7.9-runtime.jar=destfile=/root/ansible_virtualenvs/2.4.0/metron/metron-interface/metron-config/target/jacoco.exec",

"[INFO] ",

"[INFO] --- frontend-maven-plugin:1.3:install-node-and-npm (install node and npm) @ metron-config ---",

"[INFO] Using 'UTF-8' encoding to copy filtered resources.",

"[INFO] skip non existing resourceDirectory /root/ansible_virtualenvs/2.4.0/metron/metron-platform/metron-parsing/metron-enrichment/target",

"[INFO] ",

"[INFO] --- maven-resources-plugin:3.0.1:copy-resources (copy-indexing-to-kafkazk) @ metron-docker ---",

"[INFO] Using 'UTF-8' encoding to copy filtered resources.",

"[INFO] skip non existing resourceDirectory /root/ansible_virtualenvs/2.4.0/metron/metron-platform/metron-indexing/target",

"[INFO] ",

"[INFO] --- maven-resources-plugin:3.0.1:copy-resources (copy-templates-to-elasticsearch) @ metron-docker ---",

"[INFO] ",

"[INFO] --- jacoco-maven-plugin:0.7.9:prepare-agent (default) @ metron_mpack ---",

"[INFO] Using 'UTF-8' encoding to copy filtered resources.",

"[INFO] skip non existing resourceDirectory /root/ansible_virtualenvs/2.4.0/metron/metron-deployment/roles/metron_elasticsearch_templates/files/es_templates",

"[INFO] ",

"[INFO] --- maven-resources-plugin:3.0.1:copy-resources (copy-data-management-to-hbase) @ metron-docker ---",

"[INFO] argLine set to -javaagent:/root/.m2/repository/org/jacoco/org.jacoco.agent/0.7.9/org.jacoco.agent-0.7.9-runtime.jar=destfile=/root/ansible_virtualenvs/2.4.0/metron/metron-deployment/packaging/ambari/metron-mpack/target/jacoco.exec",

"[INFO] ",

"[INFO] --- maven-resources-plugin:2.6:resources (default-resources) @ metron_mpack ---",

"[INFO] Using 'UTF-8' encoding to copy filtered resources.",

"[INFO] skip non existing resourceDirectory /root/ansible_virtualenvs/2.4.0/metron/metron-platform/metron-data-management/target",

"[INFO] Skipping JaCoCo execution due to missing execution data file.",

"[INFO] ",

"[INFO] ------------------------------------------------------------------------",

"[INFO] Building metron-storm-kafka-override 0.7.1",

"[INFO] ------------------------------------------------------------------------",

"[INFO] Using 'UTF-8' encoding to copy filtered resources.",

"[INFO] Using 'UTF-8' encoding to copy filtered resources.",

"[INFO] ",

"[INFO] --- maven-resources-plugin:3.0.1:copy-resources (copy-parsers-to-storm) @ metron-docker ---",

"[INFO] Copying 1 resource",

"[INFO] Using 'UTF-8' encoding to copy filtered resources.",

"[INFO] skip non existing resourceDirectory /root/ansible_virtualenvs/2.4.0/metron/metron-platform/metron-parsing/metron-parsers-common/target",

"[INFO] ",

"[INFO] --- maven-resources-plugin:3.0.1:copy-resources (copy-enrichment-to-storm) @ metron-docker ---",

"[INFO] Using 'UTF-8' encoding to copy filtered resources.",

"[INFO] skip non existing resourceDirectory /root/ansible_virtualenvs/2.4.0/metron/metron-platform/metron-enrichment/target",

"[INFO] ",

"[INFO] --- maven-resources-plugin:3.0.1:copy-resources (copy-indexing-to-storm) @ metron-docker ---",

"[INFO] Using 'UTF-8' encoding to copy filtered resources.",

"[INFO] skip non existing resourceDirectory /root/ansible_virtualenvs/2.4.0/metron/metron-platform/metron-indexing/target",

"[INFO] ",

"[INFO] --- maven-resources-plugin:3.0.1:copy-resources (copy-elasticsearch-to-storm) @ metron-docker ---",

"[INFO] Copying 66 resources",

"[INFO] Using 'UTF-8' encoding to copy filtered resources.",

"[INFO] skip non existing resourceDirectory /root/ansible_virtualenvs/2.4.0/metron/metron-platform/metron-elasticsearch/target",

"[INFO] ",

"[INFO] --- maven-resources-plugin:3.0.1:copy-resources (filter-docker-env) @ metron-docker ---",

"[INFO] Using 'UTF-8' encoding to copy filtered resources.",

"[INFO] ",

"[INFO] --- maven-resources-plugin:2.6:testResources (default-testResources) @ elasticsearch_mpack ---",

"[INFO] Using 'UTF-8' encoding to copy filtered resources.",

"[INFO] skip non existing resourceDirectory /root/ansible_virtualenvs/2.4.0/metron/metron-deployment/packaging/ambari/elasticsearch-mpack/src/test/resources",

"[INFO] ",

"[INFO] --- maven-compiler-plugin:3.5.1:testCompile (default-testCompile) @ elasticsearch_mpack ---",

"[INFO] Installing node version v9.11.1",

"[INFO] No sources to compile",

"[INFO] ",

"[INFO] --- maven-surefire-plugin:2.18:test (default-test) @ elasticsearch_mpack ---",

"[INFO] Unpacking /root/.m2/repository/com/github/eirslett/node/9.11.1/node-9.11.1-linux-x64.tar.gz into /root/ansible_virtualenvs/2.4.0/metron/metron-interface/metron-config/node/tmp",

"[INFO] Copying 1 resource",

"[INFO] ",

"[INFO] --- maven-compiler-plugin:3.5.1:compile (default-compile) @ metron_mpack ---",

"[INFO] ",

"[INFO] --- maven-resources-plugin:3.0.1:copy-resources (copy-wait-for-it-to-hbase) @ metron-docker ---",

"[INFO] ",

"[INFO] --- maven-enforcer-plugin:1.4.1:enforce (enforce-versions) @ metron-storm-kafka-override ---",

"[INFO] ",

"[INFO] --- jacoco-maven-plugin:0.7.9:prepare-agent (default) @ metron-storm-kafka-override ---",

"[INFO] Using 'UTF-8' encoding to copy filtered resources.",

"[INFO] argLine set to -javaagent:/root/.m2/repository/org/jacoco/org.jacoco.agent/0.7.9/org.jacoco.agent-0.7.9-runtime.jar=destfile=/root/ansible_virtualenvs/2.4.0/metron/metron-platform/metron-storm-kafka-override/target/jacoco.exec",

"[INFO] ",

"[INFO] --- maven-resources-plugin:2.6:resources (default-resources) @ metron-storm-kafka-override ---",

"[INFO] Copying 1 resource",

"[INFO] Using 'UTF-8' encoding to copy filtered resources.",

"[INFO] skip non existing resourceDirectory /root/ansible_virtualenvs/2.4.0/metron/metron-platform/metron-storm-kafka-override/src/main/resources",

"[INFO] ",

"[INFO] --- maven-compiler-plugin:3.5.1:compile (default-compile) @ metron-storm-kafka-override ---",

"[INFO] Changes detected - recompiling the module!",

"[INFO] Compiling 2 source files to /root/ansible_virtualenvs/2.4.0/metron/metron-platform/metron-storm-kafka-override/target/classes",

"[INFO] No sources to compile",

"[INFO] ",

"[INFO] --- maven-resources-plugin:2.6:copy-resources (copy-resources) @ metron_mpack ---",

"[INFO] Using 'UTF-8' encoding to copy filtered resources.",

"[INFO] Copying 1 resource",

"[INFO] ",

"[INFO] --- maven-resources-plugin:3.0.1:copy-resources (copy-wait-for-it-to-kafkazk) @ metron-docker ---",

"[INFO] Using 'UTF-8' encoding to copy filtered resources.",

"[INFO] Copying 1 resource",

"[INFO] ",

"[INFO] --- maven-resources-plugin:3.0.1:copy-resources (copy-wait-for-it-to-elasticsearch) @ metron-docker ---",

"[INFO] Using 'UTF-8' encoding to copy filtered resources.",

"[INFO] Copying 1 resource",

"[INFO] ",

"[INFO] ------------------------------------------------------------------------",

"[INFO] Building metron-hbase-client 0.7.1",

"[INFO] ------------------------------------------------------------------------",

"[INFO] ",

"[INFO] --- maven-resources-plugin:2.6:testResources (default-testResources) @ metron_mpack ---",

"[INFO] Using 'UTF-8' encoding to copy filtered resources.",

"[INFO] skip non existing resourceDirectory /root/ansible_virtualenvs/2.4.0/metron/metron-deployment/packaging/ambari/metron-mpack/src/test/resources",

"[INFO] ",

"[INFO] --- maven-compiler-plugin:3.5.1:testCompile (default-testCompile) @ metron_mpack ---",

"[INFO] No sources to compile",

"[INFO] ",

"[INFO] --- maven-surefire-plugin:2.18:test (default-test) @ metron_mpack ---",

"[INFO] Tests are skipped.",

"[INFO] ",

"[INFO] --- maven-surefire-plugin:2.18:test (unit-tests) @ metron_mpack ---",

"[INFO] Tests are skipped.",

"[INFO] ",

"[INFO] --- jacoco-maven-plugin:0.7.9:report (report) @ metron_mpack ---",

"[INFO] Skipping JaCoCo execution due to missing execution data file.",

"[INFO] ",

"[INFO] --- maven-resources-plugin:2.6:copy-resources (copy-property-templates) @ metron_mpack ---",

"[INFO] Tests are skipped.",

"[INFO] ",

"[INFO] --- maven-surefire-plugin:2.18:test (unit-tests) @ elasticsearch_mpack ---",

"[INFO] Using 'UTF-8' encoding to copy filtered resources.",

"[INFO] Copying 2 resources",

"[INFO] ",

"[INFO] --- maven-enforcer-plugin:1.4.1:enforce (enforce-versions) @ metron-hbase-client ---",

"[INFO] Copying 1 resource",

"[INFO] Copying 1 resource",

"[INFO] Copying 1 resource",

"[INFO] Copying 1 resource",

"[INFO] Tests are skipped.",

"[INFO] ",

"[INFO] --- jacoco-maven-plugin:0.7.9:report (report) @ elasticsearch_mpack ---",

"[INFO] ",

"[INFO] --- maven-assembly-plugin:2.6:single (build-tarball) @ metron_mpack ---",

"[INFO] Skipping JaCoCo execution due to missing execution data file.",

"[INFO] ",

"[INFO] --- maven-assembly-plugin:2.6:single (build-tarball) @ elasticsearch_mpack ---",

"[INFO] ",

"[INFO] --- jacoco-maven-plugin:0.7.9:prepare-agent (default) @ metron-hbase-client ---",

"[INFO] ",

"[INFO] --- maven-enforcer-plugin:1.4.1:enforce (enforce-versions) @ stellar-common ---",

"[INFO] argLine set to -javaagent:/root/.m2/repository/org/jacoco/org.jacoco.agent/0.7.9/org.jacoco.agent-0.7.9-runtime.jar=destfile=/root/ansible_virtualenvs/2.4.0/metron/metron-platform/metron-hbase-client/target/jacoco.exec",

"[INFO] ",

"[INFO] --- maven-resources-plugin:2.6:resources (default-resources) @ metron-hbase-client ---",

"[INFO] Using 'UTF-8' encoding to copy filtered resources.",

"[INFO] skip non existing resourceDirectory /root/ansible_virtualenvs/2.4.0/metron/metron-platform/metron-hbase-client/src/main/resources",

"[INFO] ",

"[INFO] --- maven-compiler-plugin:3.5.1:compile (default-compile) @ metron-hbase-client ---",

"[INFO] No sources to compile",

"[INFO] ",

"[INFO] --- maven-resources-plugin:2.6:testResources (default-testResources) @ metron-hbase-client ---",

"[INFO] Using 'UTF-8' encoding to copy filtered resources.",

"[INFO] skip non existing resourceDirectory /root/ansible_virtualenvs/2.4.0/metron/metron-platform/metron-hbase-client/src/test/resources",

"[INFO] ",

"[INFO] --- maven-compiler-plugin:3.5.1:testCompile (default-testCompile) @ metron-hbase-client ---",

"[INFO] ",

"[INFO] --- jacoco-maven-plugin:0.7.9:prepare-agent (default) @ stellar-common ---",

"[INFO] No sources to compile",

"[INFO] ",

"[INFO] --- maven-surefire-plugin:2.18:test (default-test) @ metron-hbase-client ---",

"[INFO] argLine set to -javaagent:/root/.m2/repository/org/jacoco/org.jacoco.agent/0.7.9/org.jacoco.agent-0.7.9-runtime.jar=destfile=/root/ansible_virtualenvs/2.4.0/metron/metron-stellar/stellar-common/target/jacoco.exec",

"[INFO] ",

"[INFO] --- antlr4-maven-plugin:4.5:antlr4 (default) @ stellar-common ---",

"[INFO] Tests are skipped.",

"[INFO] ",

"[INFO] --- maven-surefire-plugin:2.18:test (unit-tests) @ metron-hbase-client ---",

"[INFO] Reading assembly descriptor: src/main/assemblies/metron-mpack.xml",

"[INFO] Tests are skipped.",

"[INFO] ",

"[INFO] --- jacoco-maven-plugin:0.7.9:report (report) @ metron-hbase-client ---",

"[INFO] Skipping JaCoCo execution due to missing execution data file.",

"[INFO] ",

"[INFO] --- maven-jar-plugin:3.0.2:jar (default-jar) @ metron-hbase-client ---",

"[INFO] ANTLR 4: Processing source directory /root/ansible_virtualenvs/2.4.0/metron/metron-stellar/stellar-common/src/main/antlr4",

"[INFO] Reading assembly descriptor: src/main/assemblies/elasticsearch-mpack.xml",

"[INFO] Building tar: /root/ansible_virtualenvs/2.4.0/metron/metron-deployment/packaging/ambari/elasticsearch-mpack/target/elasticsearch_mpack-0.7.1.0.tar.gz",

"[INFO] ",

"[INFO] ------------------------------------------------------------------------",

"[INFO] Building metron-parsing 0.7.1",

"[INFO] ------------------------------------------------------------------------",

"[INFO] ",

"[INFO] --- maven-enforcer-plugin:1.4.1:enforce (enforce-versions) @ metron-parsing ---",

"[INFO] ",

"[INFO] --- jacoco-maven-plugin:0.7.9:prepare-agent (default) @ metron-parsing ---",

"[INFO] argLine set to -javaagent:/root/.m2/repository/org/jacoco/org.jacoco.agent/0.7.9/org.jacoco.agent-0.7.9-runtime.jar=destfile=/root/ansible_virtualenvs/2.4.0/metron/metron-platform/metron-parsing/target/jacoco.exec",

"[INFO] ",

"[INFO] --- jacoco-maven-plugin:0.7.9:report (report) @ metron-parsing ---",

"[INFO] Skipping JaCoCo execution due to missing execution data file.",

"[INFO] ",

"[INFO] ------------------------------------------------------------------------",

"[INFO] Building elasticsearch-shaded 0.7.1",

"[INFO] ------------------------------------------------------------------------",

"[WARNING] JAR will be empty - no content was marked for inclusion!",

"[INFO] Building jar: /root/ansible_virtualenvs/2.4.0/metron/metron-platform/metron-hbase-client/target/metron-hbase-client-0.7.1.jar",

"[INFO] Processing grammar: org/apache/metron/stellar/common/generated/Stellar.g4",

"[INFO] ",

"[INFO] --- maven-jar-plugin:3.0.2:test-jar (default) @ metron-hbase-client ---",

"[WARNING] JAR will be empty - no content was marked for inclusion!",

"[INFO] Building jar: /root/ansible_virtualenvs/2.4.0/metron/metron-platform/metron-hbase-client/target/metron-hbase-client-0.7.1-tests.jar",

"[INFO] ",

"[INFO] --- maven-shade-plugin:3.2.0:shade (default) @ metron-hbase-client ---",

"[INFO] ",

"[INFO] --- maven-enforcer-plugin:1.4.1:enforce (enforce-versions) @ elasticsearch-shaded ---",

"[INFO] ",

"[INFO] --- jacoco-maven-plugin:0.7.9:prepare-agent (default) @ elasticsearch-shaded ---",

"[INFO] argLine set to -javaagent:/root/.m2/repository/org/jacoco/org.jacoco.agent/0.7.9/org.jacoco.agent-0.7.9-runtime.jar=destfile=/root/ansible_virtualenvs/2.4.0/metron/metron-platform/elasticsearch-shaded/target/jacoco.exec",

"[INFO] ",

"[INFO] --- maven-resources-plugin:2.6:resources (default-resources) @ elasticsearch-shaded ---",

"[INFO] Using 'UTF-8' encoding to copy filtered resources.",

"[INFO] Copying 2 resources",

"[INFO] ",

"[INFO] --- maven-compiler-plugin:3.5.1:compile (default-compile) @ elasticsearch-shaded ---",

"[INFO] Changes detected - recompiling the module!",

"[INFO] Compiling 1 source file to /root/ansible_virtualenvs/2.4.0/metron/metron-platform/elasticsearch-shaded/target/classes",

"[INFO] Including org.apache.hbase:hbase-shaded-client:jar:1.1.2 in the shaded jar.",

"[INFO] Including commons-logging:commons-logging:jar:1.2 in the shaded jar.",

"[INFO] Including com.google.code.findbugs:jsr305:jar:1.3.9 in the shaded jar.",

"[INFO] Including org.apache.htrace:htrace-core:jar:3.1.0-incubating in the shaded jar.",

"[INFO] Including com.github.stephenc.findbugs:findbugs-annotations:jar:1.3.9-1 in the shaded jar.",

"[INFO] Including log4j:log4j:jar:1.2.17 in the shaded jar.",

"[INFO] Excluding org.slf4j:slf4j-api:jar:1.7.7 from the shaded jar.",

"[INFO] Excluding org.slf4j:slf4j-log4j12:jar:1.7.7 from the shaded jar.",

"[INFO] Building tar: /root/ansible_virtualenvs/2.4.0/metron/metron-deployment/packaging/ambari/metron-mpack/target/metron_mpack-0.7.1.0.tar.gz",

"[INFO] Copying node binary from /root/ansible_virtualenvs/2.4.0/metron/metron-interface/metron-config/node/tmp/node-v9.11.1-linux-x64/bin/node to /root/ansible_virtualenvs/2.4.0/metron/metron-interface/metron-config/node/node",

"[INFO] ",

"[INFO] --- maven-resources-plugin:2.6:testResources (default-testResources) @ elasticsearch-shaded ---",

"[INFO] Using 'UTF-8' encoding to copy filtered resources.",

"[INFO] skip non existing resourceDirectory /root/ansible_virtualenvs/2.4.0/metron/metron-platform/elasticsearch-shaded/src/test/resources",

"[INFO] ",

"[INFO] --- maven-compiler-plugin:3.5.1:testCompile (default-testCompile) @ elasticsearch-shaded ---",

"[INFO] No sources to compile",

"[INFO] ",

"[INFO] --- maven-surefire-plugin:2.18:test (default-test) @ elasticsearch-shaded ---",

"[INFO] Tests are skipped.",

"[INFO] ",

"[INFO] --- maven-surefire-plugin:2.18:test (unit-tests) @ elasticsearch-shaded ---",

"[INFO] Tests are skipped.",

"[INFO] ",

"[INFO] --- jacoco-maven-plugin:0.7.9:report (report) @ elasticsearch-shaded ---",

"[INFO] Skipping JaCoCo execution due to missing execution data file.",

"[INFO] ",

"[INFO] --- maven-jar-plugin:2.4:jar (default-jar) @ elasticsearch-shaded ---",

"[INFO] ",

"[INFO] --- maven-resources-plugin:2.6:testResources (default-testResources) @ metron-zookeeper ---",

"[INFO] ",

"[INFO] --- maven-resources-plugin:2.6:testResources (default-testResources) @ metron-storm-kafka-override ---",

"[INFO] Using 'UTF-8' encoding to copy filtered resources.",

"[INFO] skip non existing resourceDirectory /root/ansible_virtualenvs/2.4.0/metron/metron-platform/metron-zookeeper/src/test/resources",

"[INFO] ",

"[INFO] --- maven-compiler-plugin:3.5.1:testCompile (default-testCompile) @ metron-zookeeper ---",

"[INFO] Using 'UTF-8' encoding to copy filtered resources.",

"[INFO] skip non existing resourceDirectory /root/ansible_virtualenvs/2.4.0/metron/metron-platform/metron-storm-kafka-override/src/test/resources",

"[INFO] ",

"[INFO] --- maven-compiler-plugin:3.5.1:testCompile (default-testCompile) @ metron-storm-kafka-override ---",

"[INFO] No sources to compile",

"[INFO] ",

"[INFO] --- maven-surefire-plugin:2.18:test (default-test) @ metron-zookeeper ---",

"[INFO] Tests are skipped.",

"[INFO] ",

"[INFO] --- maven-surefire-plugin:2.18:test (unit-tests) @ metron-zookeeper ---",

"[INFO] Changes detected - recompiling the module!",

"[INFO] Compiling 1 source file to /root/ansible_virtualenvs/2.4.0/metron/metron-platform/metron-storm-kafka-override/target/test-classes",

"[INFO] Tests are skipped.",

"[INFO] ",

"[INFO] --- jacoco-maven-plugin:0.7.9:report (report) @ metron-zookeeper ---",

"[INFO] Skipping JaCoCo execution due to missing execution data file.",

"[INFO] ",

"[INFO] --- maven-jar-plugin:2.4:jar (default-jar) @ metron-zookeeper ---",

"[INFO] Building jar: /root/ansible_virtualenvs/2.4.0/metron/metron-platform/elasticsearch-shaded/target/elasticsearch-shaded-0.7.1.jar",

"[INFO] Building jar: /root/ansible_virtualenvs/2.4.0/metron/metron-platform/metron-zookeeper/target/metron-zookeeper-0.7.1.jar",

"[INFO] ",

"[INFO] --- maven-shade-plugin:3.2.0:shade (default) @ elasticsearch-shaded ---",

"[INFO] Installed node locally.",

"[INFO] Installing node version v9.11.1",

"[INFO] Unpacking /root/.m2/repository/com/github/eirslett/node/9.11.1/node-9.11.1-linux-x64.tar.gz into /root/ansible_virtualenvs/2.4.0/metron/metron-interface/metron-alerts/node/tmp",

"[INFO] Installing npm version 6.2.0",

"[INFO] Unpacking /root/.m2/repository/com/github/eirslett/npm/6.2.0/npm-6.2.0.tar.gz into /root/ansible_virtualenvs/2.4.0/metron/metron-interface/metron-config/node/node_modules",

"[INFO] ",

"[INFO] ------------------------------------------------------------------------",

"[INFO] Building metron-test-utilities 0.7.1",

"[INFO] ------------------------------------------------------------------------",

"[INFO] ",

"[INFO] --- maven-resources-plugin:2.6:resources (default-resources) @ stellar-common ---",

"[INFO] Using 'UTF-8' encoding to copy filtered resources.",

"[INFO] ",

"[INFO] --- maven-surefire-plugin:2.18:test (default-test) @ metron-storm-kafka-override ---",

"[INFO] Copying 2 resources",

"[INFO] ",

"[INFO] --- maven-compiler-plugin:3.5.1:compile (default-compile) @ stellar-common ---",

"[INFO] Including com.google.guava:guava:jar:18.0 in the shaded jar.",

"[INFO] Including io.netty:netty-common:jar:4.1.13.Final in the shaded jar.",

"[INFO] Including org.elasticsearch.client:elasticsearch-rest-high-level-client:jar:5.6.14 in the shaded jar.",

"[INFO] Including org.elasticsearch.client:elasticsearch-rest-client:jar:5.6.14 in the shaded jar.",

"[INFO] Including org.apache.httpcomponents:httpclient:jar:4.5.2 in the shaded jar.",

"[INFO] Including org.apache.httpcomponents:httpcore:jar:4.4.5 in the shaded jar.",

"[INFO] Including org.apache.httpcomponents:httpasyncclient:jar:4.1.2 in the shaded jar.",

"[INFO] Including org.apache.httpcomponents:httpcore-nio:jar:4.4.5 in the shaded jar.",

"[INFO] Including commons-codec:commons-codec:jar:1.10 in the shaded jar.",

"[INFO] Including commons-logging:commons-logging:jar:1.1.3 in the shaded jar.",

"[INFO] Including org.elasticsearch.plugin:parent-join-client:jar:5.6.14 in the shaded jar.",

"[INFO] Including org.locationtech.spatial4j:spatial4j:jar:0.6 in the shaded jar.",

"[INFO] Including com.vividsolutions:jts:jar:1.13 in the shaded jar.",

"[INFO] Including org.elasticsearch.plugin:aggs-matrix-stats-client:jar:5.6.14 in the shaded jar.",

"[INFO] Including org.apache.logging.log4j:log4j-core:jar:2.8.2 in the shaded jar.",

"[INFO] Including org.apache.logging.log4j:log4j-api:jar:2.8.2 in the shaded jar.",

"[INFO] Including org.elasticsearch:elasticsearch:jar:5.6.14 in the shaded jar.",

"[INFO] Including org.apache.lucene:lucene-core:jar:6.6.1 in the shaded jar.",

"[INFO] Including org.apache.lucene:lucene-analyzers-common:jar:6.6.1 in the shaded jar.",

"[INFO] Including org.apache.lucene:lucene-backward-codecs:jar:6.6.1 in the shaded jar.",

"[INFO] Including org.apache.lucene:lucene-grouping:jar:6.6.1 in the shaded jar.",

"[INFO] Including org.apache.lucene:lucene-highlighter:jar:6.6.1 in the shaded jar.",

"[INFO] Including org.apache.lucene:lucene-join:jar:6.6.1 in the shaded jar.",

"[INFO] Including org.apache.lucene:lucene-memory:jar:6.6.1 in the shaded jar.",

"[INFO] Including org.apache.lucene:lucene-misc:jar:6.6.1 in the shaded jar.",

"[INFO] Including org.apache.lucene:lucene-queries:jar:6.6.1 in the shaded jar.",

"[INFO] Including org.apache.lucene:lucene-queryparser:jar:6.6.1 in the shaded jar.",

"[INFO] Including org.apache.lucene:lucene-sandbox:jar:6.6.1 in the shaded jar.",

"[INFO] Including org.apache.lucene:lucene-spatial:jar:6.6.1 in the shaded jar.",

"[INFO] Including org.apache.lucene:lucene-spatial-extras:jar:6.6.1 in the shaded jar.",

"[INFO] Including org.apache.lucene:lucene-spatial3d:jar:6.6.1 in the shaded jar.",

"[INFO] Including org.apache.lucene:lucene-suggest:jar:6.6.1 in the shaded jar.",

"[INFO] Including org.elasticsearch:securesm:jar:1.2 in the shaded jar.",

"[INFO] Including net.sf.jopt-simple:jopt-simple:jar:5.0.2 in the shaded jar.",

"[INFO] Including com.carrotsearch:hppc:jar:0.7.1 in the shaded jar.",

"[INFO] Including joda-time:joda-time:jar:2.10 in the shaded jar.",

"[INFO] Including org.yaml:snakeyaml:jar:1.15 in the shaded jar.",

"[INFO] Including com.tdunning:t-digest:jar:3.0 in the shaded jar.",

"[INFO] Including org.hdrhistogram:HdrHistogram:jar:2.1.9 in the shaded jar.",

"[INFO] Including org.elasticsearch:jna:jar:4.4.0-1 in the shaded jar.",

"[INFO] Including com.fasterxml.jackson.core:jackson-core:jar:2.7.4 in the shaded jar.",

"[INFO] Including com.fasterxml.jackson.dataformat:jackson-dataformat-smile:jar:2.7.4 in the shaded jar.",

"[INFO] Including com.fasterxml.jackson.dataformat:jackson-dataformat-yaml:jar:2.7.4 in the shaded jar.",

"[INFO] Including com.fasterxml.jackson.dataformat:jackson-dataformat-cbor:jar:2.7.4 in the shaded jar.",

"[INFO] Including org.slf4j:slf4j-api:jar:1.7.7 in the shaded jar.",

"[INFO] Excluding org.slf4j:slf4j-log4j12:jar:1.7.7 from the shaded jar.",

"[INFO] Including log4j:log4j:jar:1.2.17 in the shaded jar.",

"[INFO] Tests are skipped.",

"[INFO] ",

"[INFO] --- maven-surefire-plugin:2.18:test (unit-tests) @ metron-storm-kafka-override ---",

"[INFO] Tests are skipped.",

"[INFO] ",

"[INFO] --- jacoco-maven-plugin:0.7.9:report (report) @ metron-storm-kafka-override ---",

"[INFO] Changes detected - recompiling the module!",

"[INFO] Compiling 113 source files to /root/ansible_virtualenvs/2.4.0/metron/metron-stellar/stellar-common/target/classes",

"[INFO] Skipping JaCoCo execution due to missing execution data file.",

"[INFO] ",

"[INFO] --- maven-jar-plugin:2.4:jar (default-jar) @ metron-storm-kafka-override ---",

"[INFO] Building jar: /root/ansible_virtualenvs/2.4.0/metron/metron-platform/metron-storm-kafka-override/target/metron-storm-kafka-override-0.7.1.jar",

"[INFO] ",

"[INFO] --- maven-shade-plugin:3.2.0:shade (default) @ metron-storm-kafka-override ---",

"[INFO] ",

"[INFO] --- maven-enforcer-plugin:1.4.1:enforce (enforce-versions) @ metron-test-utilities ---",

"[INFO] ",

"[INFO] --- jacoco-maven-plugin:0.7.9:prepare-agent (default) @ metron-test-utilities ---",

"[INFO] argLine set to -javaagent:/root/.m2/repository/org/jacoco/org.jacoco.agent/0.7.9/org.jacoco.agent-0.7.9-runtime.jar=destfile=/root/ansible_virtualenvs/2.4.0/metron/metron-platform/metron-test-utilities/target/jacoco.exec",

"[INFO] ",

"[INFO] --- maven-resources-plugin:2.6:resources (default-resources) @ metron-test-utilities ---",

"[INFO] Using 'UTF-8' encoding to copy filtered resources.",

"[INFO] skip non existing resourceDirectory /root/ansible_virtualenvs/2.4.0/metron/metron-platform/metron-test-utilities/src/main/resources",

"[INFO] ",

"[INFO] --- maven-compiler-plugin:3.5.1:compile (default-compile) @ metron-test-utilities ---",

"[INFO] Changes detected - recompiling the module!",

"[INFO] Compiling 15 source files to /root/ansible_virtualenvs/2.4.0/metron/metron-platform/metron-test-utilities/target/classes",

"[INFO] Including com.google.guava:guava:jar:16.0.1 in the shaded jar.",

"[INFO] Including org.apache.storm:storm-kafka-client:jar:1.2.2 in the shaded jar.",

"[INFO] Including commons-lang:commons-lang:jar:2.5 in the shaded jar.",

"[INFO] Including com.fasterxml.jackson.core:jackson-databind:jar:2.9.4 in the shaded jar.",

"[INFO] Including com.fasterxml.jackson.core:jackson-annotations:jar:2.9.0 in the shaded jar.",

"[INFO] Including com.fasterxml.jackson.core:jackson-core:jar:2.9.4 in the shaded jar.",

"[INFO] Including org.apache.kafka:kafka-clients:jar:0.10.0.2.5.0.0-1245 in the shaded jar.",

"[INFO] Including net.jpountz.lz4:lz4:jar:1.3.0 in the shaded jar.",

"[INFO] Including org.xerial.snappy:snappy-java:jar:1.1.2.6 in the shaded jar.",

"[INFO] Including org.slf4j:slf4j-api:jar:1.7.7 in the shaded jar.",

"[INFO] Excluding org.slf4j:slf4j-log4j12:jar:1.7.7 from the shaded jar.",

"[INFO] Including log4j:log4j:jar:1.2.17 in the shaded jar.",

"[INFO] Installed npm locally.",

"[INFO] ",

"[INFO] --- frontend-maven-plugin:1.3:npm (npm ci) @ metron-config ---",

"[INFO] npm not inheriting proxy config from Maven",

"[INFO] Running 'npm ci' in /root/ansible_virtualenvs/2.4.0/metron/metron-interface/metron-config",

"[INFO] Copying node binary from /root/ansible_virtualenvs/2.4.0/metron/metron-interface/metron-alerts/node/tmp/node-v9.11.1-linux-x64/bin/node to /root/ansible_virtualenvs/2.4.0/metron/metron-interface/metron-alerts/node/node",

"[INFO] ",

"[INFO] --- maven-resources-plugin:2.6:testResources (default-testResources) @ metron-test-utilities ---",

"[INFO] Using 'UTF-8' encoding to copy filtered resources.",

"[INFO] skip non existing resourceDirectory /root/ansible_virtualenvs/2.4.0/metron/metron-platform/metron-test-utilities/src/test/resources",

"[INFO] ",

"[INFO] --- maven-compiler-plugin:3.5.1:testCompile (default-testCompile) @ metron-test-utilities ---",

"[INFO] No sources to compile",

"[INFO] ",

"[INFO] --- maven-surefire-plugin:2.18:test (default-test) @ metron-test-utilities ---",

"[INFO] Tests are skipped.",

"[INFO] ",

"[INFO] --- maven-surefire-plugin:2.18:test (unit-tests) @ metron-test-utilities ---",

"[INFO] Tests are skipped.",

"[INFO] ",

"[INFO] --- jacoco-maven-plugin:0.7.9:report (report) @ metron-test-utilities ---",

"[INFO] Skipping JaCoCo execution due to missing execution data file.",

"[INFO] ",

"[INFO] --- maven-jar-plugin:2.4:jar (default-jar) @ metron-test-utilities ---",

"[INFO] Building jar: /root/ansible_virtualenvs/2.4.0/metron/metron-platform/metron-test-utilities/target/metron-test-utilities-0.7.1.jar",

"[INFO] Installed node locally.",

"[INFO] Installing npm version 6.2.0",

"[INFO] Unpacking /root/.m2/repository/com/github/eirslett/npm/6.2.0/npm-6.2.0.tar.gz into /root/ansible_virtualenvs/2.4.0/metron/metron-interface/metron-alerts/node/node_modules",

"[INFO] Installed npm locally.",

"[INFO] ",

"[INFO] --- frontend-maven-plugin:1.3:npm (npm ci) @ metron-alerts ---",

"[INFO] npm not inheriting proxy config from Maven",

"[INFO] Running 'npm ci' in /root/ansible_virtualenvs/2.4.0/metron/metron-interface/metron-alerts",

"[WARNING] metron-storm-kafka-override-0.7.1.jar, storm-kafka-client-1.2.2.jar define 6 overlapping classes: ",

"[WARNING] - org.apache.storm.kafka.spout.KafkaSpoutRetryExponentialBackoff",

"[WARNING] - org.apache.storm.kafka.spout.internal.Timer",

"[WARNING] - org.apache.storm.kafka.spout.KafkaSpoutRetryExponentialBackoff$RetrySchedule",

"[WARNING] - org.apache.storm.kafka.spout.KafkaSpoutRetryExponentialBackoff$RetryEntryTimeStampComparator",

"[WARNING] - org.apache.storm.kafka.spout.KafkaSpoutRetryExponentialBackoff$TimeInterval",

"[WARNING] - org.apache.storm.kafka.spout.KafkaSpoutRetryExponentialBackoff$1",

"[WARNING] maven-shade-plugin has detected that some class files are",

"[WARNING] present in two or more JARs. When this happens, only one",

"[WARNING] single version of the class is copied to the uber jar.",

"[WARNING] Usually this is not harmful and you can skip these warnings,",

"[WARNING] otherwise try to manually exclude artifacts based on",

"[WARNING] mvn dependency:tree -Ddetail=true and the above output.",

"[WARNING] See http://maven.apache.org/plugins/maven-shade-plugin/",

"[INFO] Replacing original artifact with shaded artifact.",

"[INFO] Replacing /root/ansible_virtualenvs/2.4.0/metron/metron-platform/metron-storm-kafka-override/target/metron-storm-kafka-override-0.7.1.jar with /root/ansible_virtualenvs/2.4.0/metron/metron-platform/metron-storm-kafka-override/target/metron-storm-kafka-override-0.7.1-shaded.jar",

"[INFO] Dependency-reduced POM written at: /root/ansible_virtualenvs/2.4.0/metron/metron-platform/metron-storm-kafka-override/dependency-reduced-pom.xml",

"[INFO] ",

"[INFO] --- maven-resources-plugin:2.6:testResources (default-testResources) @ stellar-common ---",

"[INFO] Using 'UTF-8' encoding to copy filtered resources.",

"[INFO] Copying 2 resources",

"[INFO] ",

"[INFO] --- maven-compiler-plugin:3.5.1:testCompile (default-testCompile) @ stellar-common ---",

"[INFO] Changes detected - recompiling the module!",

"[INFO] Compiling 60 source files to /root/ansible_virtualenvs/2.4.0/metron/metron-stellar/stellar-common/target/test-classes",

"[INFO] ",

"[INFO] > fsevents@1.2.4 install /root/ansible_virtualenvs/2.4.0/metron/metron-interface/metron-config/node_modules/fsevents",

"[INFO] > node install",

"[INFO] ",

"[ERROR] internal/modules/cjs/loader.js:584",

"[ERROR] throw err;",

"[ERROR] ^",

"[ERROR] ",

"[ERROR] Error: Cannot find module '/root/ansible_virtualenvs/2.4.0/metron/metron-interface/metron-config/node_modules/fsevents/install'",

"[ERROR] at Function.Module._resolveFilename (internal/modules/cjs/loader.js:582:15)",

"[ERROR] at Function.Module._load (internal/modules/cjs/loader.js:508:25)",

"[ERROR] at Function.Module.runMain (internal/modules/cjs/loader.js:754:12)",

"[ERROR] at startup (internal/bootstrap/node.js:283:19)",

"[ERROR] at bootstrapNodeJSCore (internal/bootstrap/node.js:622:3)",

"[INFO] ",

"[INFO] > node-sass@4.9.3 install /root/ansible_virtualenvs/2.4.0/metron/metron-interface/metron-config/node_modules/node-sass",

"[INFO] > node scripts/install.js",

"[INFO] ",

"[ERROR] internal/modules/cjs/loader.js:584",

"[ERROR] throw err;",

"[ERROR] ^",

"[ERROR] ",

"[ERROR] Error: Cannot find module '/root/ansible_virtualenvs/2.4.0/metron/metron-interface/metron-config/node_modules/node-sass/scripts/install.js'",

"[ERROR] at Function.Module._resolveFilename (internal/modules/cjs/loader.js:582:15)",

"[ERROR] at Function.Module._load (internal/modules/cjs/loader.js:508:25)",

"[ERROR] at Function.Module.runMain (internal/modules/cjs/loader.js:754:12)",

"[ERROR] at startup (internal/bootstrap/node.js:283:19)",

"[ERROR] at bootstrapNodeJSCore (internal/bootstrap/node.js:622:3)",

"[INFO] ",

"[INFO] > puppeteer@1.8.0 install /root/ansible_virtualenvs/2.4.0/metron/metron-interface/metron-config/node_modules/puppeteer",

"[INFO] > node install.js",

"[INFO] ",

"[ERROR] internal/modules/cjs/loader.js:584",

"[ERROR] throw err;",

"[ERROR] ^",

"[ERROR] ",

"[ERROR] Error: Cannot find module '/root/ansible_virtualenvs/2.4.0/metron/metron-interface/metron-config/node_modules/puppeteer/install.js'",

"[ERROR] at Function.Module._resolveFilename (internal/modules/cjs/loader.js:582:15)",

"[ERROR] at Function.Module._load (internal/modules/cjs/loader.js:508:25)",

"[ERROR] at Function.Module.runMain (internal/modules/cjs/loader.js:754:12)",

"[ERROR] at startup (internal/bootstrap/node.js:283:19)",

"[ERROR] at bootstrapNodeJSCore (internal/bootstrap/node.js:622:3)",

"[ERROR] npm ERR! code ELIFECYCLE",

"[ERROR] npm ERR! errno 1",

"[ERROR] npm ERR! puppeteer@1.8.0 install: `node install.js`",

"[ERROR] npm ERR! Exit status 1",

"[ERROR] npm ERR! ",

"[ERROR] npm ERR! Failed at the puppeteer@1.8.0 install script.",

"[ERROR] npm ERR! This is probably not a problem with npm. There is likely additional logging output above.",

"[ERROR] ",

"[ERROR] npm ERR! A complete log of this run can be found in:",

"[ERROR] npm ERR! /root/.npm/_logs/2019-04-12T04_06_20_985Z-debug.log",

"[INFO] ------------------------------------------------------------------------",

"[INFO] Reactor Summary:",

"[INFO] ",

"[INFO] Metron ............................................. SUCCESS [ 0.596 s]",

"[INFO] metron-stellar ..................................... SUCCESS [ 0.074 s]",

"[INFO] stellar-common ..................................... SKIPPED",

"[INFO] metron-analytics ................................... SUCCESS [ 0.069 s]",

"[INFO] metron-maas-common ................................. SKIPPED",

"[INFO] metron-platform .................................... SUCCESS [ 0.708 s]",

"[INFO] metron-zookeeper ................................... SUCCESS [ 2.909 s]",

"[INFO] metron-test-utilities .............................. SUCCESS [ 2.760 s]",

"[INFO] metron-integration-test ............................ SKIPPED",

"[INFO] metron-maas-service ................................ SKIPPED",

"[INFO] metron-common ...................................... SKIPPED",

"[INFO] metron-statistics .................................. SKIPPED",

"[INFO] metron-hbase ....................................... SKIPPED",

"[INFO] metron-enrichment .................................. SKIPPED",

"[INFO] metron-enrichment-common ........................... SKIPPED",

"[INFO] metron-writer ...................................... SKIPPED",

"[INFO] metron-storm-kafka-override ........................ SUCCESS [ 10.582 s]",

"[INFO] metron-storm-kafka ................................. SKIPPED",

"[INFO] metron-profiler-common ............................. SKIPPED",

"[INFO] metron-profiler-client ............................. SKIPPED",

"[INFO] metron-profiler-storm .............................. SKIPPED",

"[INFO] metron-profiler-spark .............................. SKIPPED",

"[INFO] metron-profiler-repl ............................... SKIPPED",

"[INFO] metron-hbase-client ................................ SKIPPED",

"[INFO] metron-enrichment-storm ............................ SKIPPED",

"[INFO] metron-indexing .................................... SKIPPED",

"[INFO] metron-solr ........................................ SKIPPED",

"[INFO] metron-job ......................................... SKIPPED",

"[INFO] metron-pcap ........................................ SKIPPED",

"[INFO] metron-pcap-backend ................................ SKIPPED",

"[INFO] metron-data-management ............................. SKIPPED",

"[INFO] metron-parsing ..................................... SUCCESS [ 0.024 s]",

"[INFO] metron-parsers-common .............................. SKIPPED",

"[INFO] metron-parsers ..................................... SKIPPED",

"[INFO] metron-management .................................. SKIPPED",

"[INFO] elasticsearch-shaded ............................... SKIPPED",

"[INFO] metron-elasticsearch ............................... SKIPPED",

"[INFO] metron-parsing-storm ............................... SKIPPED",

"[INFO] metron-deployment .................................. SUCCESS [ 0.003 s]",

"[INFO] Elasticsearch Ambari Management Pack ............... SUCCESS [ 2.263 s]",

"[INFO] Metron Ambari Management Pack ...................... SUCCESS [ 3.230 s]",

"[INFO] metron-contrib ..................................... SUCCESS [ 0.031 s]",

"[INFO] metron-docker ...................................... SUCCESS [ 1.342 s]",

"[INFO] metron-performance ................................. SKIPPED",

"[INFO] metron-interface ................................... SUCCESS [ 0.037 s]",

"[INFO] metron-config ...................................... FAILURE [ 25.043 s]",

"[INFO] metron-alerts ...................................... SKIPPED",

"[INFO] metron-rest-client ................................. SKIPPED",

"[INFO] metron-rest ........................................ SKIPPED",

"[INFO] site-book .......................................... SUCCESS [ 1.127 s]",

"[INFO] 3rd party Functions (just for tests) ............... SKIPPED",

"[INFO] stellar-zeppelin ................................... SKIPPED",

"[INFO] ------------------------------------------------------------------------",

"[INFO] BUILD FAILURE",

"[INFO] ------------------------------------------------------------------------",

"[INFO] Total time: 26.187 s (Wall Clock)",

"[INFO] Finished at: 2019-04-12T12:06:23+08:00",

"[INFO] Final Memory: 595M/804M",

"[INFO] ------------------------------------------------------------------------",

"[ERROR] Failed to execute goal com.github.eirslett:frontend-maven-plugin:1.3:npm (npm ci) on project metron-config: Failed to run task: 'npm ci' failed. (error code 1) -> [Help 1]",

"[ERROR] ",

"[ERROR] To see the full stack trace of the errors, re-run Maven with the -e switch.",

"[ERROR] Re-run Maven using the -X switch to enable full debug logging.",

"[ERROR] ",

"[ERROR] For more information about the errors and possible solutions, please read the following articles:",

"[ERROR] [Help 1] http://cwiki.apache.org/confluence/display/MAVEN/MojoFailureException",

"[ERROR] ",

"[ERROR] After correcting the problems, you can resume the build with the command",

"[ERROR] mvn <goals> -rf :metron-config"

]

}




14 REPLIES 14

Re: (Apache Metron) Error in Building Metron

New Contributor

Hi,

Is there someone can help me solve this problem?

Thanks.

Re: (Apache Metron) Error in Building Metron

Super Collaborator

Hi @Akmal Latip, I am having the following versions of node and npm on my box and it works fine. Can you try with the below versions and see if it resolves your issue?

node
v9.11.1
--
npm
5.6.0
Highlighted

Re: (Apache Metron) Error in Building Metron

New Contributor

Hi @asubramanian, thanks for your response.

I still have the error even though I have downgrade the node and npm version

node
v9.11.2
-- 
npm 
5.6.0


Re: (Apache Metron) Error in Building Metron

Super Collaborator

Can you confirm that you are following the below steps to deploy:

a) cd metron-deployment/development/ubuntu14

b) vagrant up

Re: (Apache Metron) Error in Building Metron

New Contributor

Yes, to be specific, this is the directory:

/root/ansible_virtualenvs/2.4.0/metron/metron-deployment/development/centos6 or ubuntu14


Re: (Apache Metron) Error in Building Metron

Super Collaborator

Yes, those are the directories. You can spin up full dev from either of them.


Also, before attempting vagrant up, can you try to run mvn clean package -DskipTests from the top level metron directory? This should pass without issues for the full dev deployment to work properly.

Re: (Apache Metron) Error in Building Metron

New Contributor

Is this the top level metron directory?

/root/ansible_virtualenvs/2.4.0/metron

Re: (Apache Metron) Error in Building Metron

Super Collaborator
Yup, that's the top level directory

Re: (Apache Metron) Error in Building Metron

New Contributor

It stuck also at metron-config

Don't have an account?
Coming from Hortonworks? Activate your account here