Support Questions
Find answers, ask questions, and share your expertise

HDP 3.0 can't insert into hive table

New Contributor
Error while processing statement: FAILED: Execution Error, return code 2 from org.apache.hadoop.hive.ql.exec.tez.TezTask. Vertex failed, vertexName=Map 1, vertexId=vertex_1534751677600_0032_2_00, diagnostics=[Task failed, taskId=task_1534751677600_0032_2_00_000000, diagnostics=[TaskAttempt 0 failed, info=[Error: Error while running task ( failure ) : attempt_1534751677600_0032_2_00_000000_0:java.lang.IllegalArgumentException at com.google.common.base.Preconditions.checkArgument(Preconditions.java:108) at org.apache.tez.runtime.common.resources.MemoryDistributor.registerRequest(MemoryDistributor.java:177) at org.apache.tez.runtime.common.resources.MemoryDistributor.requestMemory(MemoryDistributor.java:110) at org.apache.tez.runtime.api.impl.TezTaskContextImpl.requestInitialMemory(TezTaskContextImpl.java:214) at org.apache.tez.runtime.library.output.UnorderedPartitionedKVOutput.initialize(UnorderedPartitionedKVOutput.java:76) at org.apache.tez.runtime.LogicalIOProcessorRuntimeTask$InitializeOutputCallable._callInternal(LogicalIOProcessorRuntimeTask.java:537) at org.apache.tez.runtime.LogicalIOProcessorRuntimeTask$InitializeOutputCallable.callInternal(LogicalIOProcessorRuntimeTask.java:520) at org.apache.tez.runtime.LogicalIOProcessorRuntimeTask$InitializeOutputCallable.callInternal(LogicalIOProcessorRuntimeTask.java:505) at org.apache.tez.common.CallableWithNdc.call(CallableWithNdc.java:36) at java.util.concurrent.FutureTask.run(FutureTask.java:266) at java.util.concurrent.Executors$RunnableAdapter.call(Executors.java:511) at java.util.concurrent.FutureTask.run(FutureTask.java:266) at java.util.concurrent.ThreadPoolExecutor.runWorker(ThreadPoolExecutor.java:1142) at java.util.concurrent.ThreadPoolExecutor$Worker.run(ThreadPoolExecutor.java:617) at java.lang.Thread.run(Thread.java:745) ], TaskAttempt 1 failed, info=[Error: Error while running task ( failure ) : attempt_1534751677600_0032_2_00_000000_1:java.lang.IllegalArgumentException at com.google.common.base.Preconditions.checkArgument(Preconditions.java:108) at org.apache.tez.runtime.common.resources.MemoryDistributor.registerRequest(MemoryDistributor.java:177) at org.apache.tez.runtime.common.resources.MemoryDistributor.requestMemory(MemoryDistributor.java:110) at org.apache.tez.runtime.api.impl.TezTaskContextImpl.requestInitialMemory(TezTaskContextImpl.java:214) at org.apache.tez.runtime.library.output.UnorderedPartitionedKVOutput.initialize(UnorderedPartitionedKVOutput.java:76) at org.apache.tez.runtime.LogicalIOProcessorRuntimeTask$InitializeOutputCallable._callInternal(LogicalIOProcessorRuntimeTask.java:537) at org.apache.tez.runtime.LogicalIOProcessorRuntimeTask$InitializeOutputCallable.callInternal(LogicalIOProcessorRuntimeTask.java:520) at org.apache.tez.runtime.LogicalIOProcessorRuntimeTask$InitializeOutputCallable.callInternal(LogicalIOProcessorRuntimeTask.java:505) at org.apache.tez.common.CallableWithNdc.call(CallableWithNdc.java:36) at java.util.concurrent.FutureTask.run(FutureTask.java:266) at java.util.concurrent.Executors$RunnableAdapter.call(Executors.java:511) at java.util.concurrent.FutureTask.run(FutureTask.java:266) at java.util.concurrent.ThreadPoolExecutor.runWorker(ThreadPoolExecutor.java:1142) at java.util.concurrent.ThreadPoolExecutor$Worker.run(ThreadPoolExecutor.java:617) at java.lang.Thread.run(Thread.java:745) ], TaskAttempt 2 failed, info=[Error: Error while running task ( failure ) : attempt_1534751677600_0032_2_00_000000_2:java.lang.IllegalArgumentException at com.google.common.base.Preconditions.checkArgument(Preconditions.java:108) at org.apache.tez.runtime.common.resources.MemoryDistributor.registerRequest(MemoryDistributor.java:177) at org.apache.tez.runtime.common.resources.MemoryDistributor.requestMemory(MemoryDistributor.java:110) at org.apache.tez.runtime.api.impl.TezTaskContextImpl.requestInitialMemory(TezTaskContextImpl.java:214) at org.apache.tez.runtime.library.output.UnorderedPartitionedKVOutput.initialize(UnorderedPartitionedKVOutput.java:76) at org.apache.tez.runtime.LogicalIOProcessorRuntimeTask$InitializeOutputCallable._callInternal(LogicalIOProcessorRuntimeTask.java:537) at org.apache.tez.runtime.LogicalIOProcessorRuntimeTask$InitializeOutputCallable.callInternal(LogicalIOProcessorRuntimeTask.java:520) at org.apache.tez.runtime.LogicalIOProcessorRuntimeTask$InitializeOutputCallable.callInternal(LogicalIOProcessorRuntimeTask.java:505) at org.apache.tez.common.CallableWithNdc.call(CallableWithNdc.java:36) at java.util.concurrent.FutureTask.run(FutureTask.java:266) at java.util.concurrent.Executors$RunnableAdapter.call(Executors.java:511) at java.util.concurrent.FutureTask.run(FutureTask.java:266) at java.util.concurrent.ThreadPoolExecutor.runWorker(ThreadPoolExecutor.java:1142) at java.util.concurrent.ThreadPoolExecutor$Worker.run(ThreadPoolExecutor.java:617) at java.lang.Thread.run(Thread.java:745) ], TaskAttempt 3 failed, info=[Error: Error while running task ( failure ) : attempt_1534751677600_0032_2_00_000000_3:java.lang.IllegalArgumentException at com.google.common.base.Preconditions.checkArgument(Preconditions.java:108) at org.apache.tez.runtime.common.resources.MemoryDistributor.registerRequest(MemoryDistributor.java:177) at org.apache.tez.runtime.common.resources.MemoryDistributor.requestMemory(MemoryDistributor.java:110) at org.apache.tez.runtime.api.impl.TezTaskContextImpl.requestInitialMemory(TezTaskContextImpl.java:214) at org.apache.tez.runtime.library.output.UnorderedPartitionedKVOutput.initialize(UnorderedPartitionedKVOutput.java:76) at org.apache.tez.runtime.LogicalIOProcessorRuntimeTask$InitializeOutputCallable._callInternal(LogicalIOProcessorRuntimeTask.java:537) at org.apache.tez.runtime.LogicalIOProcessorRuntimeTask$InitializeOutputCallable.callInternal(LogicalIOProcessorRuntimeTask.java:520) at org.apache.tez.runtime.LogicalIOProcessorRuntimeTask$InitializeOutputCallable.callInternal(LogicalIOProcessorRuntimeTask.java:505) at org.apache.tez.common.CallableWithNdc.call(CallableWithNdc.java:36) at java.util.concurrent.FutureTask.run(FutureTask.java:266) at java.util.concurrent.Executors$RunnableAdapter.call(Executors.java:511) at java.util.concurrent.FutureTask.run(FutureTask.java:266) at java.util.concurrent.ThreadPoolExecutor.runWorker(ThreadPoolExecutor.java:1142) at java.util.concurrent.ThreadPoolExecutor$Worker.run(ThreadPoolExecutor.java:617) at java.lang.Thread.run(Thread.java:745) ]], Vertex did not succeed due to OWN_TASK_FAILURE, failedTasks:1 killedTasks:0, Vertex vertex_1534751677600_0032_2_00 [Map 1] killed/failed due to:OWN_TASK_FAILURE]Vertex killed, vertexName=Reducer 2, vertexId=vertex_1534751677600_0032_2_01, diagnostics=[Vertex received Kill while in RUNNING state., Vertex did not succeed due to OTHER_VERTEX_FAILURE, failedTasks:0 killedTasks:1, Vertex vertex_1534751677600_0032_2_01 [Reducer 2] killed/failed due to:OTHER_VERTEX_FAILURE]DAG did not succeed due to VERTEX_FAILURE. failedVertices:1 killedVertices:1
1 ACCEPTED SOLUTION

New Contributor
2 REPLIES 2

New Contributor

Contributor

I had same issue and solved by changing "yarn.nodemanager.resource.memory-mb" from 468GB to 200GB with Amabri (There were following 11 changes.)
(I shared it because it's really hard to find out the reason by reading error messages...)

; ;