Support Questions
Find answers, ask questions, and share your expertise

Unable to load dependencies for HDP Demo project

Explorer

Failed to execute goal on project storm-streaming: Could not resolve dependencies for project com.hortonworks:storm-streaming:jar:1.0-SNAPSHOT: The following artifacts could not be resolved: sqlline:sqlline:jar:1.1.8, io.confluent:kafka-avro-serializer:jar:1.0, org.pentaho:pentaho-aggdesigner-algorithm:jar:5.1.5-jhyde: Could not find artifact sqlline:sqlline:jar:1.1.8 in nexus-hortonworks (https://repo.hortonworks.com/content/groups/public/

 

 

Could not download artifacts in any HDP sandbox versions 

5 REPLIES 5

Explorer

These are the latest dependencies after changing the pom.xml

 

Failed to execute goal on project storm-streaming: Could not resolve dependencies for project com.hortonworks:storm-streaming:jar:1.0-SNAPSHOT: The following artifacts could not be resolved: org.apache.kafka:kafka_2.10:jar:0.10.0.2.5.1.0-58, org.apache.storm:storm-core:jar:1.0.1.2.5.1.0-58, org.apache.storm:storm-kafka:jar:1.0.1.2.5.1.0-58, org.apache.storm:storm-hdfs:jar:1.0.1.2.5.1.0-58, org.apache.storm:storm-hbase:jar:1.0.1.2.5.1.0-58, org.apache.hadoop:hadoop-client:jar:2.7.3.2.5.1.0-58, org.apache.hbase:hbase-client:jar:1.1.2.2.5.1.0-58, org.apache.hive:hive-exec:jar:2.1.0.2.5.1.0-58, org.apache.hive.hcatalog:hive-hcatalog-streaming:jar:2.1.0.2.5.1.0-58, org.apache.hive.hcatalog:hive-hcatalog-core:jar:2.1.0.2.5.1.0-58, org.apache.hive:hive-cli:jar:2.1.0.2.5.1.0-58: Failure to find org.apache.kafka:kafka_2.10:jar:0.10.0.2.5.1.0-58 in https://repo.hortonworks.com/content/groups/public/ was cached in the local repository, resolution will not be reattempted until the update interval of nexus-hortonworks has elapsed or updates are forced -> [Help 1]

Explorer

With -e switch

 

 

[ERROR] Failed to execute goal on project storm-streaming: Could not resolve dependencies for project com.hortonworks:storm-streaming:jar:1.0-SNAPSHOT: The following artifacts could not be resolved: org.apache.kafka:kafka_2.10:jar:0.10.0.2.5.1.0-58, org.apache.storm:storm-core:jar:1.0.1.2.5.1.0-58, org.apache.storm:storm-kafka:jar:1.0.1.2.5.1.0-58, org.apache.storm:storm-hdfs:jar:1.0.1.2.5.1.0-58, org.apache.storm:storm-hbase:jar:1.0.1.2.5.1.0-58, org.apache.hbase:hbase-client:jar:1.1.2.2.5.1.0-58, org.apache.hive:hive-exec:jar:2.1.0.2.5.1.0-58, org.apache.hive.hcatalog:hive-hcatalog-streaming:jar:2.1.0.2.5.1.0-58, org.apache.hive.hcatalog:hive-hcatalog-core:jar:2.1.0.2.5.1.0-58, org.apache.hive:hive-cli:jar:2.1.0.2.5.1.0-58: Failure to find org.apache.kafka:kafka_2.10:jar:0.10.0.2.5.1.0-58 in https://repo.hortonworks.com/content/groups/public/ was cached in the local repository, resolution will not be reattempted until the update interval of nexus-hortonworks has elapsed or updates are forced -> [Help 1]
org.apache.maven.lifecycle.LifecycleExecutionException: Failed to execute goal on project storm-streaming: Could not resolve dependencies for project com.hortonworks:storm-streaming:jar:1.0-SNAPSHOT: The following artifacts could not be resolved: org.apache.kafka:kafka_2.10:jar:0.10.0.2.5.1.0-58, org.apache.storm:storm-core:jar:1.0.1.2.5.1.0-58, org.apache.storm:storm-kafka:jar:1.0.1.2.5.1.0-58, org.apache.storm:storm-hdfs:jar:1.0.1.2.5.1.0-58, org.apache.storm:storm-hbase:jar:1.0.1.2.5.1.0-58, org.apache.hbase:hbase-client:jar:1.1.2.2.5.1.0-58, org.apache.hive:hive-exec:jar:2.1.0.2.5.1.0-58, org.apache.hive.hcatalog:hive-hcatalog-streaming:jar:2.1.0.2.5.1.0-58, org.apache.hive.hcatalog:hive-hcatalog-core:jar:2.1.0.2.5.1.0-58, org.apache.hive:hive-cli:jar:2.1.0.2.5.1.0-58: Failure to find org.apache.kafka:kafka_2.10:jar:0.10.0.2.5.1.0-58 in https://repo.hortonworks.com/content/groups/public/ was cached in the local repository, resolution will not be reattempted until the update interval of nexus-hortonworks has elapsed or updates are forced
at org.apache.maven.lifecycle.internal.LifecycleDependencyResolver.getDependencies(LifecycleDependencyResolver.java:220)
at org.apache.maven.lifecycle.internal.LifecycleDependencyResolver.resolveProjectDependencies(LifecycleDependencyResolver.java:127)
at org.apache.maven.lifecycle.internal.MojoExecutor.ensureDependenciesAreResolved(MojoExecutor.java:257)
at org.apache.maven.lifecycle.internal.MojoExecutor.execute(MojoExecutor.java:200)
at org.apache.maven.lifecycle.internal.MojoExecutor.execute(MojoExecutor.java:153)
at org.apache.maven.lifecycle.internal.MojoExecutor.execute(MojoExecutor.java:145)
at org.apache.maven.lifecycle.internal.LifecycleModuleBuilder.buildProject(LifecycleModuleBuilder.java:116)
at org.apache.maven.lifecycle.internal.LifecycleModuleBuilder.buildProject(LifecycleModuleBuilder.java:80)
at org.apache.maven.lifecycle.internal.builder.singlethreaded.SingleThreadedBuilder.build(SingleThreadedBuilder.java:51)
at org.apache.maven.lifecycle.internal.LifecycleStarter.execute(LifecycleStarter.java:120)
at org.apache.maven.DefaultMaven.doExecute(DefaultMaven.java:355)
at org.apache.maven.DefaultMaven.execute(DefaultMaven.java:155)
at org.apache.maven.cli.MavenCli.execute(MavenCli.java:584)
at org.apache.maven.cli.MavenCli.doMain(MavenCli.java:216)
at org.apache.maven.cli.MavenCli.main(MavenCli.java:160)
at sun.reflect.NativeMethodAccessorImpl.invoke0(Native Method)
at sun.reflect.NativeMethodAccessorImpl.invoke(NativeMethodAccessorImpl.java:62)
at sun.reflect.DelegatingMethodAccessorImpl.invoke(DelegatingMethodAccessorImpl.java:43)
at java.lang.reflect.Method.invoke(Method.java:498)
at org.codehaus.plexus.classworlds.launcher.Launcher.launchEnhanced(Launcher.java:289)
at org.codehaus.plexus.classworlds.launcher.Launcher.launch(Launcher.java:229)
at org.codehaus.plexus.classworlds.launcher.Launcher.mainWithExitCode(Launcher.java:415)
at org.codehaus.plexus.classworlds.launcher.Launcher.main(Launcher.java:356)
Caused by: org.apache.maven.project.DependencyResolutionException: Could not resolve dependencies for project com.hortonworks:storm-streaming:jar:1.0-SNAPSHOT: The following artifacts could not be resolved: org.apache.kafka:kafka_2.10:jar:0.10.0.2.5.1.0-58, org.apache.storm:storm-core:jar:1.0.1.2.5.1.0-58, org.apache.storm:storm-kafka:jar:1.0.1.2.5.1.0-58, org.apache.storm:storm-hdfs:jar:1.0.1.2.5.1.0-58, org.apache.storm:storm-hbase:jar:1.0.1.2.5.1.0-58, org.apache.hbase:hbase-client:jar:1.1.2.2.5.1.0-58, org.apache.hive:hive-exec:jar:2.1.0.2.5.1.0-58, org.apache.hive.hcatalog:hive-hcatalog-streaming:jar:2.1.0.2.5.1.0-58, org.apache.hive.hcatalog:hive-hcatalog-core:jar:2.1.0.2.5.1.0-58, org.apache.hive:hive-cli:jar:2.1.0.2.5.1.0-58: Failure to find org.apache.kafka:kafka_2.10:jar:0.10.0.2.5.1.0-58 in https://repo.hortonworks.com/content/groups/public/ was cached in the local repository, resolution will not be reattempted until the update interval of nexus-hortonworks has elapsed or updates are forced
at org.apache.maven.project.DefaultProjectDependenciesResolver.resolve(DefaultProjectDependenciesResolver.java:211)
at org.apache.maven.lifecycle.internal.LifecycleDependencyResolver.getDependencies(LifecycleDependencyResolver.java:195)
... 22 more
Caused by: org.eclipse.aether.resolution.DependencyResolutionException: The following artifacts could not be resolved: org.apache.kafka:kafka_2.10:jar:0.10.0.2.5.1.0-58, org.apache.storm:storm-core:jar:1.0.1.2.5.1.0-58, org.apache.storm:storm-kafka:jar:1.0.1.2.5.1.0-58, org.apache.storm:storm-hdfs:jar:1.0.1.2.5.1.0-58, org.apache.storm:storm-hbase:jar:1.0.1.2.5.1.0-58, org.apache.hbase:hbase-client:jar:1.1.2.2.5.1.0-58, org.apache.hive:hive-exec:jar:2.1.0.2.5.1.0-58, org.apache.hive.hcatalog:hive-hcatalog-streaming:jar:2.1.0.2.5.1.0-58, org.apache.hive.hcatalog:hive-hcatalog-core:jar:2.1.0.2.5.1.0-58, org.apache.hive:hive-cli:jar:2.1.0.2.5.1.0-58: Failure to find org.apache.kafka:kafka_2.10:jar:0.10.0.2.5.1.0-58 in https://repo.hortonworks.com/content/groups/public/ was cached in the local repository, resolution will not be reattempted until the update interval of nexus-hortonworks has elapsed or updates are forced
at org.eclipse.aether.internal.impl.DefaultRepositorySystem.resolveDependencies(DefaultRepositorySystem.java:384)
at org.apache.maven.project.DefaultProjectDependenciesResolver.resolve(DefaultProjectDependenciesResolver.java:205)
... 23 more
Caused by: org.eclipse.aether.resolution.ArtifactResolutionException: The following artifacts could not be resolved: org.apache.kafka:kafka_2.10:jar:0.10.0.2.5.1.0-58, org.apache.storm:storm-core:jar:1.0.1.2.5.1.0-58, org.apache.storm:storm-kafka:jar:1.0.1.2.5.1.0-58, org.apache.storm:storm-hdfs:jar:1.0.1.2.5.1.0-58, org.apache.storm:storm-hbase:jar:1.0.1.2.5.1.0-58, org.apache.hbase:hbase-client:jar:1.1.2.2.5.1.0-58, org.apache.hive:hive-exec:jar:2.1.0.2.5.1.0-58, org.apache.hive.hcatalog:hive-hcatalog-streaming:jar:2.1.0.2.5.1.0-58, org.apache.hive.hcatalog:hive-hcatalog-core:jar:2.1.0.2.5.1.0-58, org.apache.hive:hive-cli:jar:2.1.0.2.5.1.0-58: Failure to find org.apache.kafka:kafka_2.10:jar:0.10.0.2.5.1.0-58 in https://repo.hortonworks.com/content/groups/public/ was cached in the local repository, resolution will not be reattempted until the update interval of nexus-hortonworks has elapsed or updates are forced
at org.eclipse.aether.internal.impl.DefaultArtifactResolver.resolve(DefaultArtifactResolver.java:444)
at org.eclipse.aether.internal.impl.DefaultArtifactResolver.resolveArtifacts(DefaultArtifactResolver.java:246)
at org.eclipse.aether.internal.impl.DefaultRepositorySystem.resolveDependencies(DefaultRepositorySystem.java:367)
... 24 more
Caused by: org.eclipse.aether.transfer.ArtifactNotFoundException: Failure to find org.apache.kafka:kafka_2.10:jar:0.10.0.2.5.1.0-58 in https://repo.hortonworks.com/content/groups/public/ was cached in the local repository, resolution will not be reattempted until the update interval of nexus-hortonworks has elapsed or updates are forced
at org.eclipse.aether.internal.impl.DefaultUpdateCheckManager.newException(DefaultUpdateCheckManager.java:231)
at org.eclipse.aether.internal.impl.DefaultUpdateCheckManager.checkArtifact(DefaultUpdateCheckManager.java:206)
at org.eclipse.aether.internal.impl.DefaultArtifactResolver.gatherDownloads(DefaultArtifactResolver.java:585)
at org.eclipse.aether.internal.impl.DefaultArtifactResolver.performDownloads(DefaultArtifactResolver.java:503)
at org.eclipse.aether.internal.impl.DefaultArtifactResolver.resolve(DefaultArtifactResolver.java:421)
... 26 more

Explorer

Now only those are pending

 

[ERROR] Failed to execute goal on project storm-streaming: Could not resolve dependencies for project com.hortonworks:storm-streaming:jar:1.0-SNAPSHOT: The following artifacts could not be resolved: org.apache.kafka:kafka_2.10:jar:2.10-0.10.0.2.5.0.0-1245, org.apache.storm:storm-kafka:jar:0.10.0.2.5.0.0-1245, org.apache.storm:storm-hdfs:jar:0.10.0.2.5.0.0-1245, org.pentaho:pentaho-aggdesigner-algorithm:jar:5.1.5-jhyde: Failure to find org.apache.kafka:kafka_2.10:jar:2.10-0.10.0.2.5.0.0-1245 in https://repo.hortonworks.com/content/groups/public/ was cached in the local repository, resolution will not be reattempted until the update interval of nexus-hortonworks has elapsed or updates are forced -> [Help 1]

Explorer

Please help for this urgently

 

 

[ERROR] Failed to execute goal on project storm-streaming: Could not resolve dependencies for project com.hortonworks:storm-streaming:jar:1.0-SNAPSHOT: The following artifacts could not be resolved: org.apache.kafka:kafka_2.10:jar:2.10-0.10.0.2.5.0.0-1245, org.apache.storm:storm-kafka:jar:0.10.0.2.5.0.0-1245, org.apache.storm:storm-hdfs:jar:0.10.0.2.5.0.0-1245, org.pentaho:pentaho-aggdesigner-algorithm:jar:5.1.5-jhyde: Failure to find org.apache.kafka:kafka_2.10:jar:2.10-0.10.0.2.5.0.0-1245 in https://repo.hortonworks.com/content/groups/public/ was cached in the local repository, resolution will not be reattempted until the update interval of nexus-hortonworks has elapsed or updates are forced -> [Help 1]

Explorer

I have loaded depencies one by one in .m2 directory with the required version. But still HDP 2.5 iot trucks demo Storm-streaming pushing many errors.

 

[INFO] BUILD FAILURE
[INFO] ------------------------------------------------------------------------
[INFO] Total time: 11.005 s
[INFO] Finished at: 2021-01-14T23:00:38+00:00
[INFO] Final Memory: 83M/486M
[INFO] ------------------------------------------------------------------------
[ERROR] Failed to execute goal org.apache.maven.plugins:maven-compiler-plugin:3.1:compile (default-compile) on project storm-streaming: Compilation failure: Compilation failure:
[ERROR] /root/iot-truck-streaming/storm-streaming/src/main/java/com/hortonworks/streaming/impl/bolts/Prediction.java:[3,28] package backtype.storm.tuple does not exist
[ERROR] /root/iot-truck-streaming/storm-streaming/src/main/java/com/hortonworks/streaming/impl/bolts/Prediction.java:[9,11] cannot find symbol
[ERROR] symbol: class Tuple
[ERROR] location: class com.hortonworks.streaming.impl.bolts.Prediction
[ERROR] /root/iot-truck-streaming/storm-streaming/src/main/java/com/hortonworks/streaming/impl/bolts/Prediction.java:[12,40] cannot find symbol
[ERROR] symbol: class Tuple
[ERROR] location: class com.hortonworks.streaming.impl.bolts.Prediction
[ERROR] /root/iot-truck-streaming/storm-streaming/src/main/java/com/hortonworks/streaming/impl/bolts/Prediction.java:[27,10] cannot find symbol
[ERROR] symbol: class Tuple
[ERROR] location: class com.hortonworks.streaming.impl.bolts.Prediction
[ERROR] /root/iot-truck-streaming/storm-streaming/src/main/java/com/hortonworks/streaming/impl/bolts/Prediction.java:[32,25] cannot find symbol
[ERROR] symbol: class Tuple
[ERROR] location: class com.hortonworks.streaming.impl.bolts.Prediction
[ERROR] /root/iot-truck-streaming/storm-streaming/src/main/java/com/hortonworks/streaming/impl/bolts/TruckEventRuleBolt.java:[3,27] package backtype.storm.task does not exist
[ERROR] /root/iot-truck-streaming/storm-streaming/src/main/java/com/hortonworks/streaming/impl/bolts/TruckEventRuleBolt.java:[4,27] package backtype.storm.task does not exist
[ERROR] /root/iot-truck-streaming/storm-streaming/src/main/java/com/hortonworks/streaming/impl/bolts/TruckEventRuleBolt.java:[5,31] package backtype.storm.topology does not exist
[ERROR] /root/iot-truck-streaming/storm-streaming/src/main/java/com/hortonworks/streaming/impl/bolts/TruckEventRuleBolt.java:[6,31] package backtype.storm.topology does not exist
[ERROR] /root/iot-truck-streaming/storm-streaming/src/main/java/com/hortonworks/streaming/impl/bolts/TruckEventRuleBolt.java:[7,28] package backtype.storm.tuple does not exist
[ERROR] /root/iot-truck-streaming/storm-streaming/src/main/java/com/hortonworks/streaming/impl/bolts/TruckEventRuleBolt.java:[15,44] cannot find symbol
[ERROR] symbol: class IRichBolt
[ERROR] /root/iot-truck-streaming/storm-streaming/src/main/java/com/hortonworks/streaming/impl/bolts/TruckEventRuleBolt.java:[21,11] cannot find symbol
[ERROR] symbol: class OutputCollector
[ERROR] location: class com.hortonworks.streaming.impl.bolts.TruckEventRuleBolt
[ERROR] /root/iot-truck-streaming/storm-streaming/src/main/java/com/hortonworks/streaming/impl/bolts/TruckEventRuleBolt.java:[29,38] cannot find symbol
[ERROR] symbol: class TopologyContext
[ERROR] location: class com.hortonworks.streaming.impl.bolts.TruckEventRuleBolt
[ERROR] /root/iot-truck-streaming/storm-streaming/src/main/java/com/hortonworks/streaming/impl/bolts/TruckEventRuleBolt.java:[30,23] cannot find symbol
[ERROR] symbol: class OutputCollector
[ERROR] location: class com.hortonworks.streaming.impl.bolts.TruckEventRuleBolt
[ERROR] /root/iot-truck-streaming/storm-streaming/src/main/java/com/hortonworks/streaming/impl/bolts/TruckEventRuleBolt.java:[35,23] cannot find symbol
[ERROR] symbol: class Tuple
[ERROR] location: class com.hortonworks.streaming.impl.bolts.TruckEventRuleBolt
[ERROR] /root/iot-truck-streaming/storm-streaming/src/main/java/com/hortonworks/streaming/impl/bolts/TruckEventRuleBolt.java:[61,35] cannot find symbol
[ERROR] symbol: class OutputFieldsDeclarer
[ERROR] location: class com.hortonworks.streaming.impl.bolts.TruckEventRuleBolt
[ERROR] /root/iot-truck-streaming/storm-streaming/src/main/java/com/hortonworks/streaming/impl/kafka/TruckScheme2.java:[3,28] package backtype.storm.spout does not exist
[ERROR] /root/iot-truck-streaming/storm-streaming/src/main/java/com/hortonworks/streaming/impl/kafka/TruckScheme2.java:[4,28] package backtype.storm.tuple does not exist
[ERROR] /root/iot-truck-streaming/storm-streaming/src/main/java/com/hortonworks/streaming/impl/kafka/TruckScheme2.java:[5,28] package backtype.storm.tuple does not exist
[ERROR] /root/iot-truck-streaming/storm-streaming/src/main/java/com/hortonworks/streaming/impl/kafka/TruckScheme2.java:[12,38] cannot find symbol
[ERROR] symbol: class Scheme
[ERROR] /root/iot-truck-streaming/storm-streaming/src/main/java/com/hortonworks/streaming/impl/kafka/TruckScheme2.java:[49,10] cannot find symbol
[ERROR] symbol: class Fields
[ERROR] location: class com.hortonworks.streaming.impl.kafka.TruckScheme2
[ERROR] /root/iot-truck-streaming/storm-streaming/src/main/java/com/hortonworks/streaming/impl/topologies/TruckEventProcessorKafkaTopology.java:[4,22] package backtype.storm does not exist
[ERROR] /root/iot-truck-streaming/storm-streaming/src/main/java/com/hortonworks/streaming/impl/topologies/TruckEventProcessorKafkaTopology.java:[5,22] package backtype.storm does not exist
[ERROR] /root/iot-truck-streaming/storm-streaming/src/main/java/com/hortonworks/streaming/impl/topologies/TruckEventProcessorKafkaTopology.java:[6,28] package backtype.storm.spout does not exist
[ERROR] /root/iot-truck-streaming/storm-streaming/src/main/java/com/hortonworks/streaming/impl/topologies/TruckEventProcessorKafkaTopology.java:[7,31] package backtype.storm.topology does not exist
[ERROR] /root/iot-truck-streaming/storm-streaming/src/main/java/com/hortonworks/streaming/impl/topologies/TruckEventProcessorKafkaTopology.java:[8,28] package backtype.storm.tuple does not exist
[ERROR] /root/iot-truck-streaming/storm-streaming/src/main/java/com/hortonworks/streaming/impl/topologies/TruckEventProcessorKafkaTopology.java:[21,19] package storm.kafka does not exist
[ERROR] /root/iot-truck-streaming/storm-streaming/src/main/java/com/hortonworks/streaming/impl/topologies/TruckEventProcessorKafkaTopology.java:[22,19] package storm.kafka does not exist
[ERROR] /root/iot-truck-streaming/storm-streaming/src/main/java/com/hortonworks/streaming/impl/topologies/TruckEventProcessorKafkaTopology.java:[23,19] package storm.kafka does not exist
[ERROR] /root/iot-truck-streaming/storm-streaming/src/main/java/com/hortonworks/streaming/impl/topologies/TruckEventProcessorKafkaTopology.java:[24,19] package storm.kafka does not exist
[ERROR] /root/iot-truck-streaming/storm-streaming/src/main/java/com/hortonworks/streaming/impl/topologies/TruckEventProcessorKafkaTopology.java:[93,38] cannot find symbol
[ERROR] symbol: class TopologyBuilder
[ERROR] location: class com.hortonworks.streaming.impl.topologies.TruckEventProcessorKafkaTopology
[ERROR] /root/iot-truck-streaming/storm-streaming/src/main/java/com/hortonworks/streaming/impl/topologies/TruckEventProcessorKafkaTopology.java:[101,34] cannot find symbol
[ERROR] symbol: class TopologyBuilder
[ERROR] location: class com.hortonworks.streaming.impl.topologies.TruckEventProcessorKafkaTopology
[ERROR] /root/iot-truck-streaming/storm-streaming/src/main/java/com/hortonworks/streaming/impl/topologies/TruckEventProcessorKafkaTopology.java:[111,39] cannot find symbol
[ERROR] symbol: class TopologyBuilder
[ERROR] location: class com.hortonworks.streaming.impl.topologies.TruckEventProcessorKafkaTopology
[ERROR] /root/iot-truck-streaming/storm-streaming/src/main/java/com/hortonworks/streaming/impl/topologies/TruckEventProcessorKafkaTopology.java:[118,33] cannot find symbol
[ERROR] symbol: class TopologyBuilder
[ERROR] location: class com.hortonworks.streaming.impl.topologies.TruckEventProcessorKafkaTopology
[ERROR] /root/iot-truck-streaming/storm-streaming/src/main/java/com/hortonworks/streaming/impl/topologies/TruckEventProcessorKafkaTopology.java:[165,38] cannot find symbol
[ERROR] symbol: class TopologyBuilder
[ERROR] location: class com.hortonworks.streaming.impl.topologies.TruckEventProcessorKafkaTopology
[ERROR] /root/iot-truck-streaming/storm-streaming/src/main/java/com/hortonworks/streaming/impl/topologies/TruckEventProcessorKafkaTopology.java:[180,45] cannot find symbol
[ERROR] symbol: class TopologyBuilder
[ERROR] location: class com.hortonworks.streaming.impl.topologies.TruckEventProcessorKafkaTopology
[ERROR] /root/iot-truck-streaming/storm-streaming/src/main/java/com/hortonworks/streaming/impl/topologies/TruckEventProcessorKafkaTopology.java:[189,34] cannot find symbol
[ERROR] symbol: class TopologyBuilder
[ERROR] location: class com.hortonworks.streaming.impl.topologies.TruckEventProcessorKafkaTopology
[ERROR] /root/iot-truck-streaming/storm-streaming/src/main/java/com/hortonworks/streaming/impl/topologies/TruckEventProcessorKafkaTopology.java:[197,43] cannot find symbol
[ERROR] symbol: class TopologyBuilder
[ERROR] location: class com.hortonworks.streaming.impl.topologies.TruckEventProcessorKafkaTopology
[ERROR] /root/iot-truck-streaming/storm-streaming/src/main/java/com/hortonworks/streaming/impl/topologies/TruckEventProcessorKafkaTopology.java:[204,34] cannot find symbol
[ERROR] symbol: class TopologyBuilder
[ERROR] location: class com.hortonworks.streaming.impl.topologies.TruckEventProcessorKafkaTopology
[ERROR] /root/iot-truck-streaming/storm-streaming/src/main/java/com/hortonworks/streaming/impl/topologies/TruckEventProcessorKafkaTopology.java:[214,11] cannot find symbol
[ERROR] symbol: class KafkaSpout
[ERROR] location: class com.hortonworks.streaming.impl.topologies.TruckEventProcessorKafkaTopology
[ERROR] /root/iot-truck-streaming/storm-streaming/src/main/java/com/hortonworks/streaming/impl/topologies/TruckEventProcessorKafkaTopology.java:[219,11] cannot find symbol
[ERROR] symbol: class SpoutConfig
[ERROR] location: class com.hortonworks.streaming.impl.topologies.TruckEventProcessorKafkaTopology
[ERROR] /root/iot-truck-streaming/storm-streaming/src/main/java/com/hortonworks/streaming/impl/bolts/PredictionBolt.java:[3,27] package backtype.storm.task does not exist
[ERROR] /root/iot-truck-streaming/storm-streaming/src/main/java/com/hortonworks/streaming/impl/bolts/PredictionBolt.java:[4,27] package backtype.storm.task does not exist
[ERROR] /root/iot-truck-streaming/storm-streaming/src/main/java/com/hortonworks/streaming/impl/bolts/PredictionBolt.java:[5,31] package backtype.storm.topology does not exist
[ERROR] /root/iot-truck-streaming/storm-streaming/src/main/java/com/hortonworks/streaming/impl/bolts/PredictionBolt.java:[6,31] package backtype.storm.topology does not exist
[ERROR] /root/iot-truck-streaming/storm-streaming/src/main/java/com/hortonworks/streaming/impl/bolts/PredictionBolt.java:[7,28] package backtype.storm.tuple does not exist
[ERROR] /root/iot-truck-streaming/storm-streaming/src/main/java/com/hortonworks/streaming/impl/bolts/PredictionBolt.java:[8,28] package backtype.storm.tuple does not exist
[ERROR] /root/iot-truck-streaming/storm-streaming/src/main/java/com/hortonworks/streaming/impl/bolts/PredictionBolt.java:[9,28] package backtype.storm.tuple does not exist
[ERROR] /root/iot-truck-streaming/storm-streaming/src/main/java/com/hortonworks/streaming/impl/bolts/PredictionBolt.java:[31,40] cannot find symbol
[ERROR] symbol: class IRichBolt
[ERROR] /root/iot-truck-streaming/storm-streaming/src/main/java/com/hortonworks/streaming/impl/bolts/PredictionBolt.java:[39,11] cannot find symbol
[ERROR] symbol: class OutputCollector
[ERROR] location: class com.hortonworks.streaming.impl.bolts.PredictionBolt
[ERROR] /root/iot-truck-streaming/storm-streaming/src/main/java/com/hortonworks/streaming/impl/bolts/PredictionBolt.java:[48,38] cannot find symbol
[ERROR] symbol: class TopologyContext
[ERROR] location: class com.hortonworks.streaming.impl.bolts.PredictionBolt
[ERROR] /root/iot-truck-streaming/storm-streaming/src/main/java/com/hortonworks/streaming/impl/bolts/PredictionBolt.java:[49,23] cannot find symbol
[ERROR] symbol: class OutputCollector
[ERROR] location: class com.hortonworks.streaming.impl.bolts.PredictionBolt
[ERROR] /root/iot-truck-streaming/storm-streaming/src/main/java/com/hortonworks/streaming/impl/bolts/PredictionBolt.java:[55,23] cannot find symbol
[ERROR] symbol: class Tuple
[ERROR] location: class com.hortonworks.streaming.impl.bolts.PredictionBolt
[ERROR] /root/iot-truck-streaming/storm-streaming/src/main/java/com/hortonworks/streaming/impl/bolts/PredictionBolt.java:[113,22] cannot find symbol
[ERROR] symbol: class Tuple
[ERROR] location: class com.hortonworks.streaming.impl.bolts.PredictionBolt
[ERROR] /root/iot-truck-streaming/storm-streaming/src/main/java/com/hortonworks/streaming/impl/bolts/PredictionBolt.java:[127,31] cannot find symbol
[ERROR] symbol: class Tuple
[ERROR] location: class com.hortonworks.streaming.impl.bolts.PredictionBolt
[ERROR] /root/iot-truck-streaming/storm-streaming/src/main/java/com/hortonworks/streaming/impl/bolts/PredictionBolt.java:[252,37] cannot find symbol
[ERROR] symbol: class Tuple
[ERROR] location: class com.hortonworks.streaming.impl.bolts.PredictionBolt
[ERROR] /root/iot-truck-streaming/storm-streaming/src/main/java/com/hortonworks/streaming/impl/bolts/PredictionBolt.java:[299,35] cannot find symbol
[ERROR] symbol: class OutputFieldsDeclarer
[ERROR] location: class com.hortonworks.streaming.impl.bolts.PredictionBolt
[ERROR] /root/iot-truck-streaming/storm-streaming/src/main/java/com/hortonworks/streaming/impl/bolts/PredictionWebSocketBolt.java:[3,27] package backtype.storm.task does not exist
[ERROR] /root/iot-truck-streaming/storm-streaming/src/main/java/com/hortonworks/streaming/impl/bolts/PredictionWebSocketBolt.java:[4,27] package backtype.storm.task does not exist
[ERROR] /root/iot-truck-streaming/storm-streaming/src/main/java/com/hortonworks/streaming/impl/bolts/PredictionWebSocketBolt.java:[5,31] package backtype.storm.topology does not exist
[ERROR] /root/iot-truck-streaming/storm-streaming/src/main/java/com/hortonworks/streaming/impl/bolts/PredictionWebSocketBolt.java:[6,31] package backtype.storm.topology does not exist
[ERROR] /root/iot-truck-streaming/storm-streaming/src/main/java/com/hortonworks/streaming/impl/bolts/PredictionWebSocketBolt.java:[7,28] package backtype.storm.tuple does not exist
[ERROR] /root/iot-truck-streaming/storm-streaming/src/main/java/com/hortonworks/streaming/impl/bolts/PredictionWebSocketBolt.java:[17,49] cannot find symbol
[ERROR] symbol: class IRichBolt
[ERROR] /root/iot-truck-streaming/storm-streaming/src/main/java/com/hortonworks/streaming/impl/bolts/PredictionWebSocketBolt.java:[23,11] cannot find symbol
[ERROR] symbol: class OutputCollector
[ERROR] location: class com.hortonworks.streaming.impl.bolts.PredictionWebSocketBolt
[ERROR] /root/iot-truck-streaming/storm-streaming/src/main/java/com/hortonworks/streaming/impl/bolts/PredictionWebSocketBolt.java:[40,38] cannot find symbol
[ERROR] symbol: class TopologyContext
[ERROR] location: class com.hortonworks.streaming.impl.bolts.PredictionWebSocketBolt
[ERROR] /root/iot-truck-streaming/storm-streaming/src/main/java/com/hortonworks/streaming/impl/bolts/PredictionWebSocketBolt.java:[41,23] cannot find symbol
[ERROR] symbol: class OutputCollector
[ERROR] location: class com.hortonworks.streaming.impl.bolts.PredictionWebSocketBolt
[ERROR] /root/iot-truck-streaming/storm-streaming/src/main/java/com/hortonworks/streaming/impl/bolts/PredictionWebSocketBolt.java:[51,23] cannot find symbol
[ERROR] symbol: class Tuple
[ERROR] location: class com.hortonworks.streaming.impl.bolts.PredictionWebSocketBolt
[ERROR] /root/iot-truck-streaming/storm-streaming/src/main/java/com/hortonworks/streaming/impl/bolts/PredictionWebSocketBolt.java:[145,35] cannot find symbol
[ERROR] symbol: class OutputFieldsDeclarer
[ERROR] location: class com.hortonworks.streaming.impl.bolts.PredictionWebSocketBolt
[ERROR] /root/iot-truck-streaming/storm-streaming/src/main/java/com/hortonworks/streaming/impl/bolts/DroolsWebSocketBolt.java:[3,27] package backtype.storm.task does not exist
[ERROR] /root/iot-truck-streaming/storm-streaming/src/main/java/com/hortonworks/streaming/impl/bolts/DroolsWebSocketBolt.java:[4,27] package backtype.storm.task does not exist
[ERROR] /root/iot-truck-streaming/storm-streaming/src/main/java/com/hortonworks/streaming/impl/bolts/DroolsWebSocketBolt.java:[5,31] package backtype.storm.topology does not exist
[ERROR] /root/iot-truck-streaming/storm-streaming/src/main/java/com/hortonworks/streaming/impl/bolts/DroolsWebSocketBolt.java:[6,31] package backtype.storm.topology does not exist
[ERROR] /root/iot-truck-streaming/storm-streaming/src/main/java/com/hortonworks/streaming/impl/bolts/DroolsWebSocketBolt.java:[7,28] package backtype.storm.tuple does not exist
[ERROR] /root/iot-truck-streaming/storm-streaming/src/main/java/com/hortonworks/streaming/impl/bolts/DroolsWebSocketBolt.java:[16,45] cannot find symbol
[ERROR] symbol: class IRichBolt
[ERROR] /root/iot-truck-streaming/storm-streaming/src/main/java/com/hortonworks/streaming/impl/bolts/DroolsWebSocketBolt.java:[21,11] cannot find symbol
[ERROR] symbol: class OutputCollector
[ERROR] location: class com.hortonworks.streaming.impl.bolts.DroolsWebSocketBolt
[ERROR] /root/iot-truck-streaming/storm-streaming/src/main/java/com/hortonworks/streaming/impl/bolts/DroolsWebSocketBolt.java:[34,38] cannot find symbol
[ERROR] symbol: class TopologyContext
[ERROR] location: class com.hortonworks.streaming.impl.bolts.DroolsWebSocketBolt
[ERROR] /root/iot-truck-streaming/storm-streaming/src/main/java/com/hortonworks/streaming/impl/bolts/DroolsWebSocketBolt.java:[35,23] cannot find symbol
[ERROR] symbol: class OutputCollector
[ERROR] location: class com.hortonworks.streaming.impl.bolts.DroolsWebSocketBolt
[ERROR] /root/iot-truck-streaming/storm-streaming/src/main/java/com/hortonworks/streaming/impl/bolts/DroolsWebSocketBolt.java:[45,23] cannot find symbol
[ERROR] symbol: class Tuple
[ERROR] location: class com.hortonworks.streaming.impl.bolts.DroolsWebSocketBolt
[ERROR] /root/iot-truck-streaming/storm-streaming/src/main/java/com/hortonworks/streaming/impl/bolts/DroolsWebSocketBolt.java:[125,35] cannot find symbol
[ERROR] symbol: class OutputFieldsDeclarer
[ERROR] location: class com.hortonworks.streaming.impl.bolts.DroolsWebSocketBolt
[ERROR] /root/iot-truck-streaming/storm-streaming/src/main/java/com/hortonworks/streaming/impl/bolts/PredictionBoltJPMML.java:[3,27] package backtype.storm.task does not exist
[ERROR] /root/iot-truck-streaming/storm-streaming/src/main/java/com/hortonworks/streaming/impl/bolts/PredictionBoltJPMML.java:[4,27] package backtype.storm.task does not exist
[ERROR] /root/iot-truck-streaming/storm-streaming/src/main/java/com/hortonworks/streaming/impl/bolts/PredictionBoltJPMML.java:[5,31] package backtype.storm.topology does not exist
[ERROR] /root/iot-truck-streaming/storm-streaming/src/main/java/com/hortonworks/streaming/impl/bolts/PredictionBoltJPMML.java:[6,31] package backtype.storm.topology does not exist
[ERROR] /root/iot-truck-streaming/storm-streaming/src/main/java/com/hortonworks/streaming/impl/bolts/PredictionBoltJPMML.java:[7,28] package backtype.storm.tuple does not exist
[ERROR] /root/iot-truck-streaming/storm-streaming/src/main/java/com/hortonworks/streaming/impl/bolts/PredictionBoltJPMML.java:[8,28] package backtype.storm.tuple does not exist
[ERROR] /root/iot-truck-streaming/storm-streaming/src/main/java/com/hortonworks/streaming/impl/bolts/PredictionBoltJPMML.java:[9,28] package backtype.storm.tuple does not exist
[ERROR] /root/iot-truck-streaming/storm-streaming/src/main/java/com/hortonworks/streaming/impl/bolts/PredictionBoltJPMML.java:[33,45] cannot find symbol
[ERROR] symbol: class IRichBolt
[ERROR] /root/iot-truck-streaming/storm-streaming/src/main/java/com/hortonworks/streaming/impl/bolts/PredictionBoltJPMML.java:[39,11] cannot find symbol
[ERROR] symbol: class OutputCollector
[ERROR] location: class com.hortonworks.streaming.impl.bolts.PredictionBoltJPMML
[ERROR] /root/iot-truck-streaming/storm-streaming/src/main/java/com/hortonworks/streaming/impl/bolts/PredictionBoltJPMML.java:[48,38] cannot find symbol
[ERROR] symbol: class TopologyContext
[ERROR] location: class com.hortonworks.streaming.impl.bolts.PredictionBoltJPMML
[ERROR] /root/iot-truck-streaming/storm-streaming/src/main/java/com/hortonworks/streaming/impl/bolts/PredictionBoltJPMML.java:[49,23] cannot find symbol
[ERROR] symbol: class OutputCollector
[ERROR] location: class com.hortonworks.streaming.impl.bolts.PredictionBoltJPMML
[ERROR] /root/iot-truck-streaming/storm-streaming/src/main/java/com/hortonworks/streaming/impl/bolts/PredictionBoltJPMML.java:[55,23] cannot find symbol
[ERROR] symbol: class Tuple
[ERROR] location: class com.hortonworks.streaming.impl.bolts.PredictionBoltJPMML
[ERROR] /root/iot-truck-streaming/storm-streaming/src/main/java/com/hortonworks/streaming/impl/bolts/PredictionBoltJPMML.java:[107,22] cannot find symbol
[ERROR] symbol: class Tuple
[ERROR] location: class com.hortonworks.streaming.impl.bolts.PredictionBoltJPMML
[ERROR] /root/iot-truck-streaming/storm-streaming/src/main/java/com/hortonworks/streaming/impl/bolts/PredictionBoltJPMML.java:[119,31] cannot find symbol
[ERROR] symbol: class Tuple
[ERROR] location: class com.hortonworks.streaming.impl.bolts.PredictionBoltJPMML
[ERROR] /root/iot-truck-streaming/storm-streaming/src/main/java/com/hortonworks/streaming/impl/bolts/PredictionBoltJPMML.java:[242,37] cannot find symbol
[ERROR] symbol: class Tuple
[ERROR] location: class com.hortonworks.streaming.impl.bolts.PredictionBoltJPMML
[ERROR] /root/iot-truck-streaming/storm-streaming/src/main/java/com/hortonworks/streaming/impl/bolts/PredictionBoltJPMML.java:[278,35] cannot find symbol
[ERROR] symbol: class OutputFieldsDeclarer
[ERROR] location: class com.hortonworks.streaming.impl.bolts.PredictionBoltJPMML
[ERROR] /root/iot-truck-streaming/storm-streaming/src/main/java/com/hortonworks/streaming/impl/bolts/TruckHBaseBolt.java:[3,27] package backtype.storm.task does not exist
[ERROR] /root/iot-truck-streaming/storm-streaming/src/main/java/com/hortonworks/streaming/impl/bolts/TruckHBaseBolt.java:[4,27] package backtype.storm.task does not exist
[ERROR] /root/iot-truck-streaming/storm-streaming/src/main/java/com/hortonworks/streaming/impl/bolts/TruckHBaseBolt.java:[5,31] package backtype.storm.topology does not exist
[ERROR] /root/iot-truck-streaming/storm-streaming/src/main/java/com/hortonworks/streaming/impl/bolts/TruckHBaseBolt.java:[6,31] package backtype.storm.topology does not exist
[ERROR] /root/iot-truck-streaming/storm-streaming/src/main/java/com/hortonworks/streaming/impl/bolts/TruckHBaseBolt.java:[7,28] package backtype.storm.tuple does not exist