Support Questions
Find answers, ask questions, and share your expertise

hive insert query is failing and giving the below vertex error ?

Solved Go to solution

hive insert query is failing and giving the below vertex error ?

Super Collaborator

0: jdbc:hive2://ip-10-0-10-76.amer.o9solution> INSERT INTO TABLE schema_7539.activityparameters PARTITION(versionkey) SELECT activitykey, productkey, transportkey, activityleadtime, null, null, versionkey FROM schema_7539.activityparameters_4ITEM_1; INFO : Compiling command(queryId=hive_20180910110101_cbf45448-beba-44b9-854b-779c5593797b): INSERT INTO TABLE schema_7539.activityparameters PARTITION(versionkey) SELECT activitykey, productkey, transportkey, activityleadtime, null, null, versionkey FROM schema_7539.activityparameters_4ITEM_1 INFO : Semantic Analysis Completed (retrial = false) INFO : Returning Hive schema: Schema(fieldSchemas:[FieldSchema(name:_col0, type:int, comment:null), FieldSchema(name:_col1, type:int, comment:null), FieldSchema(name:_col2, type:int, comment:null), FieldSchema(name:_col3, type:float, comment:null), FieldSchema(name:_col4, type:date, comment:null), FieldSchema(name:_col5, type:date, comment:null), FieldSchema(name:_col6, type:int, comment:null)], properties:null) INFO : Completed compiling command(queryId=hive_20180910110101_cbf45448-beba-44b9-854b-779c5593797b); Time taken: 0.253 seconds INFO : Executing command(queryId=hive_20180910110101_cbf45448-beba-44b9-854b-779c5593797b): INSERT INTO TABLE schema_7539.activityparameters PARTITION(versionkey) SELECT activitykey, productkey, transportkey, activityleadtime, null, null, versionkey FROM schema_7539.activityparameters_4ITEM_1 INFO : Query ID = hive_20180910110101_cbf45448-beba-44b9-854b-779c5593797b INFO : Total jobs = 1 INFO : Launching Job 1 out of 1 INFO : Starting task [Stage-1:MAPRED] in parallel ---------------------------------------------------------------------------------------------- VERTICES MODE STATUS TOTAL COMPLETED RUNNING PENDING FAILED KILLED ---------------------------------------------------------------------------------------------- Map 1 container RUNNING 1 0 0 1 4 0 Reducer 2 container INITED 50 0 0 50 0 0 ---------------------------------------------------------------------------------------------- VERTICES: 00/02 [>>--------------------------] 0% ELAPSED TIME: 9.50 s ---------------------------------------------------------------------------------------------- ERROR : FAILED: Execution Error, return code 2 from org.apache.hadoop.hive.ql.exec.tez.TezTask. Vertex failed, vertexName=Map 1, vertexId=vertex_1536574043605_0015_1_00, diagnostics=[Task failed, taskId=task_1536574043605_0015_1_00_000000, diagnostics=[TaskAttempt 0 failed, info=[Error: Error while running task ( failure ) : attempt_1536574043605_0015_1_00_000000_0:java.lang.IllegalArgumentException at com.google.common.base.Preconditions.checkArgument(Preconditions.java:108) at org.apache.tez.runtime.common.resources.MemoryDistributor.registerRequest(MemoryDistributor.java:177) at org.apache.tez.runtime.common.resources.MemoryDistributor.requestMemory(MemoryDistributor.java:110) at org.apache.tez.runtime.api.impl.TezTaskContextImpl.requestInitialMemory(TezTaskContextImpl.java:214) at org.apache.tez.runtime.library.output.UnorderedPartitionedKVOutput.initialize(UnorderedPartitionedKVOutput.java:76) at org.apache.tez.runtime.LogicalIOProcessorRuntimeTask$InitializeOutputCallable._callInternal(LogicalIOProcessorRuntimeTask.java:537) at org.apache.tez.runtime.LogicalIOProcessorRuntimeTask$InitializeOutputCallable.callInternal(LogicalIOProcessorRuntimeTask.java:520) at org.apache.tez.runtime.LogicalIOProcessorRuntimeTask$InitializeOutputCallable.callInternal(LogicalIOProcessorRuntimeTask.java:505) at org.apache.tez.common.CallableWithNdc.call(CallableWithNdc.java:36) at java.util.concurrent.FutureTask.run(FutureTask.java:266) at java.util.concurrent.Executors$RunnableAdapter.call(Executors.java:511) at java.util.concurrent.FutureTask.run(FutureTask.java:266) at java.util.concurrent.ThreadPoolExecutor.runWorker(ThreadPoolExecutor.java:1142) at java.util.concurrent.ThreadPoolExecutor$Worker.run(ThreadPoolExecutor.java:617) at java.lang.Thread.run(Thread.java:745) ], TaskAttempt 1 failed, info=[Error: Error while running task ( failure ) : attempt_1536574043605_0015_1_00_000000_1:java.lang.IllegalArgumentException at com.google.common.base.Preconditions.checkArgument(Preconditions.java:108) at org.apache.tez.runtime.common.resources.MemoryDistributor.registerRequest(MemoryDistributor.java:177) at org.apache.tez.runtime.common.resources.MemoryDistributor.requestMemory(MemoryDistributor.java:110) at org.apache.tez.runtime.api.impl.TezTaskContextImpl.requestInitialMemory(TezTaskContextImpl.java:214) at org.apache.tez.runtime.library.output.UnorderedPartitionedKVOutput.initialize(UnorderedPartitionedKVOutput.java:76) at org.apache.tez.runtime.LogicalIOProcessorRuntimeTask$InitializeOutputCallable._callInternal(LogicalIOProcessorRuntimeTask.java:537) at org.apache.tez.runtime.LogicalIOProcessorRuntimeTask$InitializeOutputCallable.callInternal(LogicalIOProcessorRuntimeTask.java:520) at org.apache.tez.runtime.LogicalIOProcessorRuntimeTask$InitializeOutputCallable.callInternal(LogicalIOProcessorRuntimeTask.java:505) at org.apache.tez.common.CallableWithNdc.call(CallableWithNdc.java:36) at java.util.concurrent.FutureTask.run(FutureTask.java:266) at java.util.concurrent.Executors$RunnableAdapter.call(Executors.java:511) at java.util.concurrent.FutureTask.run(FutureTask.java:266) at java.util.concurrent.ThreadPoolExecutor.runWorker(ThreadPoolExecutor.java:1142) at java.util.concurrent.ThreadPoolExecutor$Worker.run(ThreadPoolExecutor.java:617) at java.lang.Thread.run(Thread.java:745) ], TaskAttempt 2 failed, info=[Error: Error while running task ( failure ) : attempt_1536574043605_0015_1_00_000000_2:java.lang.IllegalArgumentException at com.google.common.base.Preconditions.checkArgument(Preconditions.java:108) at org.apache.tez.runtime.common.resources.MemoryDistributor.registerRequest(MemoryDistributor.java:177) at org.apache.tez.runtime.common.resources.MemoryDistributor.requestMemory(MemoryDistributor.java:110) at org.apache.tez.runtime.api.impl.TezTaskContextImpl.requestInitialMemory(TezTaskContextImpl.java:214) at org.apache.tez.runtime.library.output.UnorderedPartitionedKVOutput.initialize(UnorderedPartitionedKVOutput.java:76) at org.apache.tez.runtime.LogicalIOProcessorRuntimeTask$InitializeOutputCallable._callInternal(LogicalIOProcessorRuntimeTask.java:537) at org.apache.tez.runtime.LogicalIOProcessorRuntimeTask$InitializeOutputCallable.callInternal(LogicalIOProcessorRuntimeTask.java:520) at org.apache.tez.runtime.LogicalIOProcessorRuntimeTask$InitializeOutputCallable.callInternal(LogicalIOProcessorRuntimeTask.java:505) at org.apache.tez.common.CallableWithNdc.call(CallableWithNdc.java:36) at java.util.concurrent.FutureTask.run(FutureTask.java:266) at java.util.concurrent.Executors$RunnableAdapter.call(Executors.java:511) at java.util.concurrent.FutureTask.run(FutureTask.java:266) at java.util.concurrent.ThreadPoolExecutor.runWorker(ThreadPoolExecutor.java:1142) at java.util.concurrent.ThreadPoolExecutor$Worker.run(ThreadPoolExecutor.java:617) at java.lang.Thread.run(Thread.java:745) ], TaskAttempt 3 failed, info=[Error: Error while running task ( failure ) : attempt_1536574043605_0015_1_00_000000_3:java.lang.IllegalArgumentException at com.google.common.base.Preconditions.checkArgument(Preconditions.java:108) at org.apache.tez.runtime.common.resources.MemoryDistributor.registerRequest(MemoryDistributor.java:177) at org.apache.tez.runtime.common.resources.MemoryDistributor.requestMemory(MemoryDistributor.java:110) at org.apache.tez.runtime.api.impl.TezTaskContextImpl.requestInitialMemory(TezTaskContextImpl.java:214) at org.apache.tez.runtime.library.output.UnorderedPartitionedKVOutput.initialize(UnorderedPartitionedKVOutput.java:76) at org.apache.tez.runtime.LogicalIOProcessorRuntimeTask$InitializeOutputCallable._callInternal(LogicalIOProcessorRuntimeTask.java:537) at org.apache.tez.runtime.LogicalIOProcessorRuntimeTask$InitializeOutputCallable.callInternal(LogicalIOProcessorRuntimeTask.java:520) at org.apache.tez.runtime.LogicalIOProcessorRuntimeTask$InitializeOutputCallable.callInternal(LogicalIOProcessorRuntimeTask.java:505) at org.apache.tez.common.CallableWithNdc.call(CallableWithNdc.java:36) at java.util.concurrent.FutureTask.run(FutureTask.java:266) at java.util.concurrent.Executors$RunnableAdapter.call(Executors.java:511) at java.util.concurrent.FutureTask.run(FutureTask.java:266) at java.util.concurrent.ThreadPoolExecutor.runWorker(ThreadPoolExecutor.java:1142) at java.util.concurrent.ThreadPoolExecutor$Worker.run(ThreadPoolExecutor.java:617) at java.lang.Thread.run(Thread.java:745) ]], Vertex did not succeed due to OWN_TASK_FAILURE, failedTasks:1 killedTasks:0, Vertex vertex_1536574043605_0015_1_00 [Map 1] killed/failed due to:OWN_TASK_FAILURE]Vertex killed, vertexName=Reducer 2, vertexId=vertex_1536574043605_0015_1_01, diagnostics=[Vertex received Kill while in RUNNING state., Vertex did not succeed due to OTHER_VERTEX_FAILURE, failedTasks:0 killedTasks:50, Vertex vertex_1536574043605_0015_1_01 [Reducer 2] killed/failed due to:OTHER_VERTEX_FAILURE]DAG did not succeed due to VERTEX_FAILURE. failedVertices:1 killedVertices:1 INFO : Completed executing command(queryId=hive_20180910110101_cbf45448-beba-44b9-854b-779c5593797b); Time taken: 16.005 seconds Error: Error while processing statement: FAILED: Execution Error, return code 2 from org.apache.hadoop.hive.ql.exec.tez.TezTask. Vertex failed, vertexName=Map 1, vertexId=vertex_1536574043605_0015_1_00, diagnostics=[Task failed, taskId=task_1536574043605_0015_1_00_000000, diagnostics=[TaskAttempt 0 failed, info=[Error: Error while running task ( failure ) : attempt_1536574043605_0015_1_00_000000_0:java.lang.IllegalArgumentException at com.google.common.base.Preconditions.checkArgument(Preconditions.java:108) at org.apache.tez.runtime.common.resources.MemoryDistributor.registerRequest(MemoryDistributor.java:177) at org.apache.tez.runtime.common.resources.MemoryDistributor.requestMemory(MemoryDistributor.java:110) at org.apache.tez.runtime.api.impl.TezTaskContextImpl.requestInitialMemory(TezTaskContextImpl.java:214) at org.apache.tez.runtime.library.output.UnorderedPartitionedKVOutput.initialize(UnorderedPartitionedKVOutput.java:76) at org.apache.tez.runtime.LogicalIOProcessorRuntimeTask$InitializeOutputCallable._callInternal(LogicalIOProcessorRuntimeTask.java:537) at org.apache.tez.runtime.LogicalIOProcessorRuntimeTask$InitializeOutputCallable.callInternal(LogicalIOProcessorRuntimeTask.java:520) at org.apache.tez.runtime.LogicalIOProcessorRuntimeTask$InitializeOutputCallable.callInternal(LogicalIOProcessorRuntimeTask.java:505) at org.apache.tez.common.CallableWithNdc.call(CallableWithNdc.java:36) at java.util.concurrent.FutureTask.run(FutureTask.java:266) at java.util.concurrent.Executors$RunnableAdapter.call(Executors.java:511) at java.util.concurrent.FutureTask.run(FutureTask.java:266) at java.util.concurrent.ThreadPoolExecutor.runWorker(ThreadPoolExecutor.java:1142) at java.util.concurrent.ThreadPoolExecutor$Worker.run(ThreadPoolExecutor.java:617) at java.lang.Thread.run(Thread.java:745) ], TaskAttempt 1 failed, info=[Error: Error while running task ( failure ) : attempt_1536574043605_0015_1_00_000000_1:java.lang.IllegalArgumentException at com.google.common.base.Preconditions.checkArgument(Preconditions.java:108) at org.apache.tez.runtime.common.resources.MemoryDistributor.registerRequest(MemoryDistributor.java:177) at org.apache.tez.runtime.common.resources.MemoryDistributor.requestMemory(MemoryDistributor.java:110) at org.apache.tez.runtime.api.impl.TezTaskContextImpl.requestInitialMemory(TezTaskContextImpl.java:214) at org.apache.tez.runtime.library.output.UnorderedPartitionedKVOutput.initialize(UnorderedPartitionedKVOutput.java:76) at org.apache.tez.runtime.LogicalIOProcessorRuntimeTask$InitializeOutputCallable._callInternal(LogicalIOProcessorRuntimeTask.java:537) at org.apache.tez.runtime.LogicalIOProcessorRuntimeTask$InitializeOutputCallable.callInternal(LogicalIOProcessorRuntimeTask.java:520) at org.apache.tez.runtime.LogicalIOProcessorRuntimeTask$InitializeOutputCallable.callInternal(LogicalIOProcessorRuntimeTask.java:505) at org.apache.tez.common.CallableWithNdc.call(CallableWithNdc.java:36) at java.util.concurrent.FutureTask.run(FutureTask.java:266) at java.util.concurrent.Executors$RunnableAdapter.call(Executors.java:511) at java.util.concurrent.FutureTask.run(FutureTask.java:266) at java.util.concurrent.ThreadPoolExecutor.runWorker(ThreadPoolExecutor.java:1142) at java.util.concurrent.ThreadPoolExecutor$Worker.run(ThreadPoolExecutor.java:617) at java.lang.Thread.run(Thread.java:745) ], TaskAttempt 2 failed, info=[Error: Error while running task ( failure ) : attempt_1536574043605_0015_1_00_000000_2:java.lang.IllegalArgumentException at com.google.common.base.Preconditions.checkArgument(Preconditions.java:108) at org.apache.tez.runtime.common.resources.MemoryDistributor.registerRequest(MemoryDistributor.java:177) at org.apache.tez.runtime.common.resources.MemoryDistributor.requestMemory(MemoryDistributor.java:110) at org.apache.tez.runtime.api.impl.TezTaskContextImpl.requestInitialMemory(TezTaskContextImpl.java:214) at org.apache.tez.runtime.library.output.UnorderedPartitionedKVOutput.initialize(UnorderedPartitionedKVOutput.java:76) at org.apache.tez.runtime.LogicalIOProcessorRuntimeTask$InitializeOutputCallable._callInternal(LogicalIOProcessorRuntimeTask.java:537) at org.apache.tez.runtime.LogicalIOProcessorRuntimeTask$InitializeOutputCallable.callInternal(LogicalIOProcessorRuntimeTask.java:520) at org.apache.tez.runtime.LogicalIOProcessorRuntimeTask$InitializeOutputCallable.callInternal(LogicalIOProcessorRuntimeTask.java:505) at org.apache.tez.common.CallableWithNdc.call(CallableWithNdc.java:36) at java.util.concurrent.FutureTask.run(FutureTask.java:266) at java.util.concurrent.Executors$RunnableAdapter.call(Executors.java:511) at java.util.concurrent.FutureTask.run(FutureTask.java:266) at java.util.concurrent.ThreadPoolExecutor.runWorker(ThreadPoolExecutor.java:1142) at java.util.concurrent.ThreadPoolExecutor$Worker.run(ThreadPoolExecutor.java:617) at java.lang.Thread.run(Thread.java:745) ], TaskAttempt 3 failed, info=[Error: Error while running task ( failure ) : attempt_1536574043605_0015_1_00_000000_3:java.lang.IllegalArgumentException at com.google.common.base.Preconditions.checkArgument(Preconditions.java:108) at org.apache.tez.runtime.common.resources.MemoryDistributor.registerRequest(MemoryDistributor.java:177) at org.apache.tez.runtime.common.resources.MemoryDistributor.requestMemory(MemoryDistributor.java:110) at org.apache.tez.runtime.api.impl.TezTaskContextImpl.requestInitialMemory(TezTaskContextImpl.java:214) at org.apache.tez.runtime.library.output.UnorderedPartitionedKVOutput.initialize(UnorderedPartitionedKVOutput.java:76) at org.apache.tez.runtime.LogicalIOProcessorRuntimeTask$InitializeOutputCallable._callInternal(LogicalIOProcessorRuntimeTask.java:537) at org.apache.tez.runtime.LogicalIOProcessorRuntimeTask$InitializeOutputCallable.callInternal(LogicalIOProcessorRuntimeTask.java:520) at org.apache.tez.runtime.LogicalIOProcessorRuntimeTask$InitializeOutputCallable.callInternal(LogicalIOProcessorRuntimeTask.java:505) at org.apache.tez.common.CallableWithNdc.call(CallableWithNdc.java:36) at java.util.concurrent.FutureTask.run(FutureTask.java:266) at java.util.concurrent.Executors$RunnableAdapter.call(Executors.java:511) at java.util.concurrent.FutureTask.run(FutureTask.java:266) at java.util.concurrent.ThreadPoolExecutor.runWorker(ThreadPoolExecutor.java:1142) at java.util.concurrent.ThreadPoolExecutor$Worker.run(ThreadPoolExecutor.java:617) at java.lang.Thread.run(Thread.java:745) ]], Vertex did not succeed due to OWN_TASK_FAILURE, failedTasks:1 killedTasks:0, Vertex vertex_1536574043605_0015_1_00 [Map 1] killed/failed due to:OWN_TASK_FAILURE]Vertex killed, vertexName=Reducer 2, vertexId=vertex_1536574043605_0015_1_01, diagnostics=[Vertex received Kill while in RUNNING state., Vertex did not succeed due to OTHER_VERTEX_FAILURE, failedTasks:0 killedTasks:50, Vertex vertex_1536574043605_0015_1_01 [Reducer 2] killed/failed due to:OTHER_VERTEX_FAILURE]DAG did not succeed due to VERTEX_FAILURE. failedVertices:1 killedVertices:1 (state=08S01,code=2)

1 ACCEPTED SOLUTION

Accepted Solutions
Highlighted

Re: hive insert query is failing and giving the below vertex error ?

Expert Contributor

Can you check what is the value for tez.runtime.unordered.output.buffer.size-mb ? I think its configured to an higher value.

View solution in original post

3 REPLIES 3
Highlighted

Re: hive insert query is failing and giving the below vertex error ?

Expert Contributor

Can you check what is the value for tez.runtime.unordered.output.buffer.size-mb ? I think its configured to an higher value.

View solution in original post

Highlighted

Re: hive insert query is failing and giving the below vertex error ?

Super Collaborator

Hi Naresh,

It's set to 2227 MB.

Highlighted

Re: hive insert query is failing and giving the below vertex error ?

Explorer

alter table schema_7539.activityparameters_4ITEM_1 COMPACT 'MAJOR'; in hive then re run query. If that does't work run query in spark hive context.