Our Community is getting an upgrade! To get everything ready for the relaunch, we’ll be placing the site in read-only mode starting September 21st.
We really appreciate your understanding while we get things set up behind the scenes. Catch up on all the exciting details about the move here.
Need help or have questions? Drop us a line at [email protected]
Created 02-22-2016 10:32 PM
Started getting below error on our transactional table after hadoop upgraded to 2.7.1.2.3.4.0-3485. Has below hive components
hive-metastore - 2.3.4.0-3485
hive-server2 - 2.3.4.0-3485
hive-webhcat - 2.3.4.0-3485
Error:
[Reducer 2] killed/failed due to:OWN_TASK_FAILURE]
DAG did not succeed due to VERTEX_FAILURE. failedVertices:1 killedVertices:0
FAILED: Execution Error, return code 2 from org.apache.hadoop.hive.ql.exec.tez.TezTask. Vertex failed, vertexName=Reducer 2, vertexId=vertex_1454370757362_0111_1_01, diagnostics=[Task failed, taskId=task_1454370757362_0111_1_01_000000, diagnostics=[TaskAttempt 0 failed, info=[Error: Failure while running task:java.lang.RuntimeException: java.lang.RuntimeException: org.apache.hadoop.hive.ql.metadata.HiveException: Hive Runtime Error while processing row (tag=0) {"key":{"reducesinkkey0":{"transactionid":0,"bucketid":-1,"rowid":0}},"value":{"_col0":"462015"}}
Caused by: java.lang.ArrayIndexOutOfBoundsException: -1
at org.apache.hadoop.hive.ql.exec.FileSinkOperator.process(FileSinkOperator.java:781)
at org.apache.hadoop.hive.ql.exec.Operator.forward(Operator.java:838)
at org.apache.hadoop.hive.ql.exec.SelectOperator.process(SelectOperator.java:88)
at org.apache.hadoop.hive.ql.exec.tez.ReduceRecordSource$GroupIterator.next(ReduceRecordSource.java:361)
... 17 more
Created 02-23-2016 10:34 AM
1) See this official article https://community.hortonworks.com/articles/4321/hive-acid-current-state.html
You can see that we don't recommend ACID
2) Based on 1, there is a chance that it's a bug "Caused by: java.lang.ArrayIndexOutOfBoundsException:-1"
Created 02-22-2016 10:32 PM
Happens on HIVE DELETE operation on transactional tables.
Created 02-23-2016 10:34 AM
1) See this official article https://community.hortonworks.com/articles/4321/hive-acid-current-state.html
You can see that we don't recommend ACID
2) Based on 1, there is a chance that it's a bug "Caused by: java.lang.ArrayIndexOutOfBoundsException:-1"
Created 02-23-2016 02:48 PM
Thanks Neeraj. We got same advice from hortonworks too. Just posted here to see if someone has faced it in real time.
Created 06-02-2016 12:56 PM
Hi @Neeraj Sabharwal, has this issue been resolved in HDP 2.4?
Created 03-03-2016 05:31 PM
My client has the similar issue which fails while the job being submitted using capacity scheduler, where it works fine with fair scheduler.
Created 06-20-2016 04:23 PM
Hi,
Do you know if there are any updates on this?
I am facing similar errors when executing delete statements from a table.
{noformat}
Status: Running (Executing on YARN cluster with App id application_1465976940057_0697) -------------------------------------------------------------------------------- VERTICES STATUS TOTAL COMPLETED RUNNING PENDING FAILED KILLED -------------------------------------------------------------------------------- Map 1 .......... SUCCEEDED 1 1 0 0 0 0 Reducer 2 ..... FAILED 10 9 0 1 4 0 -------------------------------------------------------------------------------- VERTICES: 01/02 [=======================>>---] 90% ELAPSED TIME: 14.03 s -------------------------------------------------------------------------------- Status: Failed Vertex failed, vertexName=Reducer 2, vertexId=vertex_1465976940057_0697_4_01, diagnostics=[Task failed, taskId=task_1465976940057_0697_4_01_000007, diagnostics=[TaskAttempt 0 failed, info=[Error: Failure while running task:java.lang.RuntimeException: java.lang.RuntimeException: org.apache.hadoop.hive.ql.metadata.HiveException: Hive Runtime Error while processing row (tag=0) {"key":{"reducesinkkey0":{"transactionid":0,"bucketid":-1,"rowid":0}},"value":null} at org.apache.hadoop.hive.ql.exec.tez.TezProcessor.initializeAndRunProcessor(TezProcessor.java:171) at org.apache.hadoop.hive.ql.exec.tez.TezProcessor.run(TezProcessor.java:137) at org.apache.tez.runtime.LogicalIOProcessorRuntimeTask.run(LogicalIOProcessorRuntimeTask.java:344) at org.apache.tez.runtime.task.TezTaskRunner$TaskRunnerCallable$1.run(TezTaskRunner.java:179) at org.apache.tez.runtime.task.TezTaskRunner$TaskRunnerCallable$1.run(TezTaskRunner.java:171) at java.security.AccessController.doPrivileged(Native Method) at javax.security.auth.Subject.doAs(Subject.java:422) at org.apache.hadoop.security.UserGroupInformation.doAs(UserGroupInformation.java:1657) at org.apache.tez.runtime.task.TezTaskRunner$TaskRunnerCallable.callInternal(TezTaskRunner.java:171) at org.apache.tez.runtime.task.TezTaskRunner$TaskRunnerCallable.callInternal(TezTaskRunner.java:167) at org.apache.tez.common.CallableWithNdc.call(CallableWithNdc.java:36) at java.util.concurrent.FutureTask.run(FutureTask.java:266) at java.util.concurrent.ThreadPoolExecutor.runWorker(ThreadPoolExecutor.java:1142) at java.util.concurrent.ThreadPoolExecutor$Worker.run(ThreadPoolExecutor.java:617) at java.lang.Thread.run(Thread.java:745) Caused by: java.lang.RuntimeException: org.apache.hadoop.hive.ql.metadata.HiveException: Hive Runtime Error while processing row (tag=0) {"key":{"reducesinkkey0":{"transactionid":0,"bucketid":-1,"rowid":0}},"value":null} at org.apache.hadoop.hive.ql.exec.tez.ReduceRecordSource.pushRecord(ReduceRecordSource.java:302) at org.apache.hadoop.hive.ql.exec.tez.ReduceRecordProcessor.run(ReduceRecordProcessor.java:249) at org.apache.hadoop.hive.ql.exec.tez.TezProcessor.initializeAndRunProcessor(TezProcessor.java:148) ... 14 more Caused by: org.apache.hadoop.hive.ql.metadata.HiveException: Hive Runtime Error while processing row (tag=0) {"key":{"reducesinkkey0":{"transactionid":0,"bucketid":-1,"rowid":0}},"value":null} at org.apache.hadoop.hive.ql.exec.tez.ReduceRecordSource$GroupIterator.next(ReduceRecordSource.java:370) at org.apache.hadoop.hive.ql.exec.tez.ReduceRecordSource.pushRecord(ReduceRecordSource.java:292) ... 16 more Caused by: java.lang.ArrayIndexOutOfBoundsException: -1 at org.apache.hadoop.hive.ql.exec.FileSinkOperator.process(FileSinkOperator.java:781) at org.apache.hadoop.hive.ql.exec.Operator.forward(Operator.java:838) at org.apache.hadoop.hive.ql.exec.SelectOperator.process(SelectOperator.java:88) at org.apache.hadoop.hive.ql.exec.tez.ReduceRecordSource$GroupIterator.next(ReduceRecordSource.java:361) ... 17 more ], TaskAttempt 1 failed, info=[Error: Failure while running task:java.lang.RuntimeException: java.lang.RuntimeException: org.apache.hadoop.hive.ql.metadata.HiveException: Hive Runtime Error while processing row (tag=0) {"key":{"reducesinkkey0":{"transactionid":0,"bucketid":-1,"rowid":0}},"value":null} at org.apache.hadoop.hive.ql.exec.tez.TezProcessor.initializeAndRunProcessor(TezProcessor.java:171) at org.apache.hadoop.hive.ql.exec.tez.TezProcessor.run(TezProcessor.java:137) at org.apache.tez.runtime.LogicalIOProcessorRuntimeTask.run(LogicalIOProcessorRuntimeTask.java:344) at org.apache.tez.runtime.task.TezTaskRunner$TaskRunnerCallable$1.run(TezTaskRunner.java:179) at org.apache.tez.runtime.task.TezTaskRunner$TaskRunnerCallable$1.run(TezTaskRunner.java:171) at java.security.AccessController.doPrivileged(Native Method) at javax.security.auth.Subject.doAs(Subject.java:422) at org.apache.hadoop.security.UserGroupInformation.doAs(UserGroupInformation.java:1657) at org.apache.tez.runtime.task.TezTaskRunner$TaskRunnerCallable.callInternal(TezTaskRunner.java:171) at org.apache.tez.runtime.task.TezTaskRunner$TaskRunnerCallable.callInternal(TezTaskRunner.java:167) at org.apache.tez.common.CallableWithNdc.call(CallableWithNdc.java:36) at java.util.concurrent.FutureTask.run(FutureTask.java:266) at java.util.concurrent.ThreadPoolExecutor.runWorker(ThreadPoolExecutor.java:1142) at java.util.concurrent.ThreadPoolExecutor$Worker.run(ThreadPoolExecutor.java:617) at java.lang.Thread.run(Thread.java:745) Caused by: java.lang.RuntimeException: org.apache.hadoop.hive.ql.metadata.HiveException: Hive Runtime Error while processing row (tag=0) {"key":{"reducesinkkey0":{"transactionid":0,"bucketid":-1,"rowid":0}},"value":null} at org.apache.hadoop.hive.ql.exec.tez.ReduceRecordSource.pushRecord(ReduceRecordSource.java:302) at org.apache.hadoop.hive.ql.exec.tez.ReduceRecordProcessor.run(ReduceRecordProcessor.java:249) at org.apache.hadoop.hive.ql.exec.tez.TezProcessor.initializeAndRunProcessor(TezProcessor.java:148) ... 14 more Caused by: org.apache.hadoop.hive.ql.metadata.HiveException: Hive Runtime Error while processing row (tag=0) {"key":{"reducesinkkey0":{"transactionid":0,"bucketid":-1,"rowid":0}},"value":null} at org.apache.hadoop.hive.ql.exec.tez.ReduceRecordSource$GroupIterator.next(ReduceRecordSource.java:370) at org.apache.hadoop.hive.ql.exec.tez.ReduceRecordSource.pushRecord(ReduceRecordSource.java:292) ... 16 more Caused by: java.lang.ArrayIndexOutOfBoundsException: -1 at org.apache.hadoop.hive.ql.exec.FileSinkOperator.process(FileSinkOperator.java:781) at org.apache.hadoop.hive.ql.exec.Operator.forward(Operator.java:838) at org.apache.hadoop.hive.ql.exec.SelectOperator.process(SelectOperator.java:88) at org.apache.hadoop.hive.ql.exec.tez.ReduceRecordSource$GroupIterator.next(ReduceRecordSource.java:361) ... 17 more ], TaskAttempt 2 failed, info=[Error: Failure while running task:java.lang.RuntimeException: java.lang.RuntimeException: org.apache.hadoop.hive.ql.metadata.HiveException: Hive Runtime Error while processing row (tag=0) {"key":{"reducesinkkey0":{"transactionid":0,"bucketid":-1,"rowid":0}},"value":null} at org.apache.hadoop.hive.ql.exec.tez.TezProcessor.initializeAndRunProcessor(TezProcessor.java:171) at org.apache.hadoop.hive.ql.exec.tez.TezProcessor.run(TezProcessor.java:137) at org.apache.tez.runtime.LogicalIOProcessorRuntimeTask.run(LogicalIOProcessorRuntimeTask.java:344) at org.apache.tez.runtime.task.TezTaskRunner$TaskRunnerCallable$1.run(TezTaskRunner.java:179) at org.apache.tez.runtime.task.TezTaskRunner$TaskRunnerCallable$1.run(TezTaskRunner.java:171) at java.security.AccessController.doPrivileged(Native Method) at javax.security.auth.Subject.doAs(Subject.java:422) at org.apache.hadoop.security.UserGroupInformation.doAs(UserGroupInformation.java:1657) at org.apache.tez.runtime.task.TezTaskRunner$TaskRunnerCallable.callInternal(TezTaskRunner.java:171) at org.apache.tez.runtime.task.TezTaskRunner$TaskRunnerCallable.callInternal(TezTaskRunner.java:167) at org.apache.tez.common.CallableWithNdc.call(CallableWithNdc.java:36) at java.util.concurrent.FutureTask.run(FutureTask.java:266) at java.util.concurrent.ThreadPoolExecutor.runWorker(ThreadPoolExecutor.java:1142) at java.util.concurrent.ThreadPoolExecutor$Worker.run(ThreadPoolExecutor.java:617) at java.lang.Thread.run(Thread.java:745) Caused by: java.lang.RuntimeException: org.apache.hadoop.hive.ql.metadata.HiveException: Hive Runtime Error while processing row (tag=0) {"key":{"reducesinkkey0":{"transactionid":0,"bucketid":-1,"rowid":0}},"value":null} at org.apache.hadoop.hive.ql.exec.tez.ReduceRecordSource.pushRecord(ReduceRecordSource.java:302) at org.apache.hadoop.hive.ql.exec.tez.ReduceRecordProcessor.run(ReduceRecordProcessor.java:249) at org.apache.hadoop.hive.ql.exec.tez.TezProcessor.initializeAndRunProcessor(TezProcessor.java:148) ... 14 more Caused by: org.apache.hadoop.hive.ql.metadata.HiveException: Hive Runtime Error while processing row (tag=0) {"key":{"reducesinkkey0":{"transactionid":0,"bucketid":-1,"rowid":0}},"value":null} at org.apache.hadoop.hive.ql.exec.tez.ReduceRecordSource$GroupIterator.next(ReduceRecordSource.java:370) at org.apache.hadoop.hive.ql.exec.tez.ReduceRecordSource.pushRecord(ReduceRecordSource.java:292) ... 16 more Caused by: java.lang.ArrayIndexOutOfBoundsException: -1 at org.apache.hadoop.hive.ql.exec.FileSinkOperator.process(FileSinkOperator.java:781) at org.apache.hadoop.hive.ql.exec.Operator.forward(Operator.java:838) at org.apache.hadoop.hive.ql.exec.SelectOperator.process(SelectOperator.java:88) at org.apache.hadoop.hive.ql.exec.tez.ReduceRecordSource$GroupIterator.next(ReduceRecordSource.java:361) ... 17 more ], TaskAttempt 3 failed, info=[Error: Failure while running task:java.lang.RuntimeException: java.lang.RuntimeException: org.apache.hadoop.hive.ql.metadata.HiveException: Hive Runtime Error while processing row (tag=0) {"key":{"reducesinkkey0":{"transactionid":0,"bucketid":-1,"rowid":0}},"value":null} at org.apache.hadoop.hive.ql.exec.tez.TezProcessor.initializeAndRunProcessor(TezProcessor.java:171) at org.apache.hadoop.hive.ql.exec.tez.TezProcessor.run(TezProcessor.java:137) at org.apache.tez.runtime.LogicalIOProcessorRuntimeTask.run(LogicalIOProcessorRuntimeTask.java:344) at org.apache.tez.runtime.task.TezTaskRunner$TaskRunnerCallable$1.run(TezTaskRunner.java:179) at org.apache.tez.runtime.task.TezTaskRunner$TaskRunnerCallable$1.run(TezTaskRunner.java:171) at java.security.AccessController.doPrivileged(Native Method) at javax.security.auth.Subject.doAs(Subject.java:422) at org.apache.hadoop.security.UserGroupInformation.doAs(UserGroupInformation.java:1657) at org.apache.tez.runtime.task.TezTaskRunner$TaskRunnerCallable.callInternal(TezTaskRunner.java:171) at org.apache.tez.runtime.task.TezTaskRunner$TaskRunnerCallable.callInternal(TezTaskRunner.java:167) at org.apache.tez.common.CallableWithNdc.call(CallableWithNdc.java:36) at java.util.concurrent.FutureTask.run(FutureTask.java:266) at java.util.concurrent.ThreadPoolExecutor.runWorker(ThreadPoolExecutor.java:1142) at java.util.concurrent.ThreadPoolExecutor$Worker.run(ThreadPoolExecutor.java:617) at java.lang.Thread.run(Thread.java:745) Caused by: java.lang.RuntimeException: org.apache.hadoop.hive.ql.metadata.HiveException: Hive Runtime Error while processing row (tag=0) {"key":{"reducesinkkey0":{"transactionid":0,"bucketid":-1,"rowid":0}},"value":null} at org.apache.hadoop.hive.ql.exec.tez.ReduceRecordSource.pushRecord(ReduceRecordSource.java:302) at org.apache.hadoop.hive.ql.exec.tez.ReduceRecordProcessor.run(ReduceRecordProcessor.java:249) at org.apache.hadoop.hive.ql.exec.tez.TezProcessor.initializeAndRunProcessor(TezProcessor.java:148) ... 14 more Caused by: org.apache.hadoop.hive.ql.metadata.HiveException: Hive Runtime Error while processing row (tag=0) {"key":{"reducesinkkey0":{"transactionid":0,"bucketid":-1,"rowid":0}},"value":null} at org.apache.hadoop.hive.ql.exec.tez.ReduceRecordSource$GroupIterator.next(ReduceRecordSource.java:370) at org.apache.hadoop.hive.ql.exec.tez.ReduceRecordSource.pushRecord(ReduceRecordSource.java:292) ... 16 more Caused by: java.lang.ArrayIndexOutOfBoundsException: -1 at org.apache.hadoop.hive.ql.exec.FileSinkOperator.process(FileSinkOperator.java:781) at org.apache.hadoop.hive.ql.exec.Operator.forward(Operator.java:838) at org.apache.hadoop.hive.ql.exec.SelectOperator.process(SelectOperator.java:88) at org.apache.hadoop.hive.ql.exec.tez.ReduceRecordSource$GroupIterator.next(ReduceRecordSource.java:361) ... 17 more ]], Vertex did not succeed due to OWN_TASK_FAILURE, failedTasks:1 killedTasks:0, Vertex vertex_1465976940057_0697_4_01 [Reducer 2] killed/failed due to:OWN_TASK_FAILURE] DAG did not succeed due to VERTEX_FAILURE. failedVertices:1 killedVertices:0 FAILED: Execution Error, return code 2 from org.apache.hadoop.hive.ql.exec.tez.TezTask. Vertex failed, vertexName=Reducer 2, vertexId=vertex_1465976940057_0697_4_01, diagnostics=[Task failed, taskId=task_1465976940057_0697_4_01_000007, diagnostics=[TaskAttempt 0 failed, info=[Error: Failure while running task:java.lang.RuntimeException: java.lang.RuntimeException: org.apache.hadoop.hive.ql.metadata.HiveException: Hive Runtime Error while processing row (tag=0) {"key":{"reducesinkkey0":{"transactionid":0,"bucketid":-1,"rowid":0}},"value":null} at org.apache.hadoop.hive.ql.exec.tez.TezProcessor.initializeAndRunProcessor(TezProcessor.java:171) at org.apache.hadoop.hive.ql.exec.tez.TezProcessor.run(TezProcessor.java:137) at org.apache.tez.runtime.LogicalIOProcessorRuntimeTask.run(LogicalIOProcessorRuntimeTask.java:344) at org.apache.tez.runtime.task.TezTaskRunner$TaskRunnerCallable$1.run(TezTaskRunner.java:179) at org.apache.tez.runtime.task.TezTaskRunner$TaskRunnerCallable$1.run(TezTaskRunner.java:171) at java.security.AccessController.doPrivileged(Native Method) at javax.security.auth.Subject.doAs(Subject.java:422) at org.apache.hadoop.security.UserGroupInformation.doAs(UserGroupInformation.java:1657) at org.apache.tez.runtime.task.TezTaskRunner$TaskRunnerCallable.callInternal(TezTaskRunner.java:171) at org.apache.tez.runtime.task.TezTaskRunner$TaskRunnerCallable.callInternal(TezTaskRunner.java:167) at org.apache.tez.common.CallableWithNdc.call(CallableWithNdc.java:36) at java.util.concurrent.FutureTask.run(FutureTask.java:266) at java.util.concurrent.ThreadPoolExecutor.runWorker(ThreadPoolExecutor.java:1142) at java.util.concurrent.ThreadPoolExecutor$Worker.run(ThreadPoolExecutor.java:617) at java.lang.Thread.run(Thread.java:745) Caused by: java.lang.RuntimeException: org.apache.hadoop.hive.ql.metadata.HiveException: Hive Runtime Error while processing row (tag=0) {"key":{"reducesinkkey0":{"transactionid":0,"bucketid":-1,"rowid":0}},"value":null} at org.apache.hadoop.hive.ql.exec.tez.ReduceRecordSource.pushRecord(ReduceRecordSource.java:302) at org.apache.hadoop.hive.ql.exec.tez.ReduceRecordProcessor.run(ReduceRecordProcessor.java:249) at org.apache.hadoop.hive.ql.exec.tez.TezProcessor.initializeAndRunProcessor(TezProcessor.java:148) ... 14 more Caused by: org.apache.hadoop.hive.ql.metadata.HiveException: Hive Runtime Error while processing row (tag=0) {"key":{"reducesinkkey0":{"transactionid":0,"bucketid":-1,"rowid":0}},"value":null} at org.apache.hadoop.hive.ql.exec.tez.ReduceRecordSource$GroupIterator.next(ReduceRecordSource.java:370) at org.apache.hadoop.hive.ql.exec.tez.ReduceRecordSource.pushRecord(ReduceRecordSource.java:292) ... 16 more Caused by: java.lang.ArrayIndexOutOfBoundsException: -1 at org.apache.hadoop.hive.ql.exec.FileSinkOperator.process(FileSinkOperator.java:781) at org.apache.hadoop.hive.ql.exec.Operator.forward(Operator.java:838) at org.apache.hadoop.hive.ql.exec.SelectOperator.process(SelectOperator.java:88) at org.apache.hadoop.hive.ql.exec.tez.ReduceRecordSource$GroupIterator.next(ReduceRecordSource.java:361) ... 17 more ], TaskAttempt 1 failed, info=[Error: Failure while running task:java.lang.RuntimeException: java.lang.RuntimeException: org.apache.hadoop.hive.ql.metadata.HiveException: Hive Runtime Error while processing row (tag=0) {"key":{"reducesinkkey0":{"transactionid":0,"bucketid":-1,"rowid":0}},"value":null} at org.apache.hadoop.hive.ql.exec.tez.TezProcessor.initializeAndRunProcessor(TezProcessor.java:171) at org.apache.hadoop.hive.ql.exec.tez.TezProcessor.run(TezProcessor.java:137) at org.apache.tez.runtime.LogicalIOProcessorRuntimeTask.run(LogicalIOProcessorRuntimeTask.java:344) at org.apache.tez.runtime.task.TezTaskRunner$TaskRunnerCallable$1.run(TezTaskRunner.java:179) at org.apache.tez.runtime.task.TezTaskRunner$TaskRunnerCallable$1.run(TezTaskRunner.java:171) at java.security.AccessController.doPrivileged(Native Method) at javax.security.auth.Subject.doAs(Subject.java:422) at org.apache.hadoop.security.UserGroupInformation.doAs(UserGroupInformation.java:1657) at org.apache.tez.runtime.task.TezTaskRunner$TaskRunnerCallable.callInternal(TezTaskRunner.java:171) at org.apache.tez.runtime.task.TezTaskRunner$TaskRunnerCallable.callInternal(TezTaskRunner.java:167) at org.apache.tez.common.CallableWithNdc.call(CallableWithNdc.java:36) at java.util.concurrent.FutureTask.run(FutureTask.java:266) at java.util.concurrent.ThreadPoolExecutor.runWorker(ThreadPoolExecutor.java:1142) at java.util.concurrent.ThreadPoolExecutor$Worker.run(ThreadPoolExecutor.java:617) at java.lang.Thread.run(Thread.java:745) Caused by: java.lang.RuntimeException: org.apache.hadoop.hive.ql.metadata.HiveException: Hive Runtime Error while processing row (tag=0) {"key":{"reducesinkkey0":{"transactionid":0,"bucketid":-1,"rowid":0}},"value":null} at org.apache.hadoop.hive.ql.exec.tez.ReduceRecordSource.pushRecord(ReduceRecordSource.java:302) at org.apache.hadoop.hive.ql.exec.tez.ReduceRecordProcessor.run(ReduceRecordProcessor.java:249) at org.apache.hadoop.hive.ql.exec.tez.TezProcessor.initializeAndRunProcessor(TezProcessor.java:148) ... 14 more Caused by: org.apache.hadoop.hive.ql.metadata.HiveException: Hive Runtime Error while processing row (tag=0) {"key":{"reducesinkkey0":{"transactionid":0,"bucketid":-1,"rowid":0}},"value":null} at org.apache.hadoop.hive.ql.exec.tez.ReduceRecordSource$GroupIterator.next(ReduceRecordSource.java:370) at org.apache.hadoop.hive.ql.exec.tez.ReduceRecordSource.pushRecord(ReduceRecordSource.java:292) ... 16 more Caused by: java.lang.ArrayIndexOutOfBoundsException: -1 at org.apache.hadoop.hive.ql.exec.FileSinkOperator.process(FileSinkOperator.java:781) at org.apache.hadoop.hive.ql.exec.Operator.forward(Operator.java:838) at org.apache.hadoop.hive.ql.exec.SelectOperator.process(SelectOperator.java:88) at org.apache.hadoop.hive.ql.exec.tez.ReduceRecordSource$GroupIterator.next(ReduceRecordSource.java:361) ... 17 more ], TaskAttempt 2 failed, info=[Error: Failure while running task:java.lang.RuntimeException: java.lang.RuntimeException: org.apache.hadoop.hive.ql.metadata.HiveException: Hive Runtime Error while processing row (tag=0) {"key":{"reducesinkkey0":{"transactionid":0,"bucketid":-1,"rowid":0}},"value":null} at org.apache.hadoop.hive.ql.exec.tez.TezProcessor.initializeAndRunProcessor(TezProcessor.java:171) at org.apache.hadoop.hive.ql.exec.tez.TezProcessor.run(TezProcessor.java:137) at org.apache.tez.runtime.LogicalIOProcessorRuntimeTask.run(LogicalIOProcessorRuntimeTask.java:344) at org.apache.tez.runtime.task.TezTaskRunner$TaskRunnerCallable$1.run(TezTaskRunner.java:179) at org.apache.tez.runtime.task.TezTaskRunner$TaskRunnerCallable$1.run(TezTaskRunner.java:171) at java.security.AccessController.doPrivileged(Native Method) at javax.security.auth.Subject.doAs(Subject.java:422) at org.apache.hadoop.security.UserGroupInformation.doAs(UserGroupInformation.java:1657) at org.apache.tez.runtime.task.TezTaskRunner$TaskRunnerCallable.callInternal(TezTaskRunner.java:171) at org.apache.tez.runtime.task.TezTaskRunner$TaskRunnerCallable.callInternal(TezTaskRunner.java:167) at org.apache.tez.common.CallableWithNdc.call(CallableWithNdc.java:36) at java.util.concurrent.FutureTask.run(FutureTask.java:266) at java.util.concurrent.ThreadPoolExecutor.runWorker(ThreadPoolExecutor.java:1142) at java.util.concurrent.ThreadPoolExecutor$Worker.run(ThreadPoolExecutor.java:617) at java.lang.Thread.run(Thread.java:745) Caused by: java.lang.RuntimeException: org.apache.hadoop.hive.ql.metadata.HiveException: Hive Runtime Error while processing row (tag=0) {"key":{"reducesinkkey0":{"transactionid":0,"bucketid":-1,"rowid":0}},"value":null} at org.apache.hadoop.hive.ql.exec.tez.ReduceRecordSource.pushRecord(ReduceRecordSource.java:302) at org.apache.hadoop.hive.ql.exec.tez.ReduceRecordProcessor.run(ReduceRecordProcessor.java:249) at org.apache.hadoop.hive.ql.exec.tez.TezProcessor.initializeAndRunProcessor(TezProcessor.java:148) ... 14 more Caused by: org.apache.hadoop.hive.ql.metadata.HiveException: Hive Runtime Error while processing row (tag=0) {"key":{"reducesinkkey0":{"transactionid":0,"bucketid":-1,"rowid":0}},"value":null} at org.apache.hadoop.hive.ql.exec.tez.ReduceRecordSource$GroupIterator.next(ReduceRecordSource.java:370) at org.apache.hadoop.hive.ql.exec.tez.ReduceRecordSource.pushRecord(ReduceRecordSource.java:292) ... 16 more Caused by: java.lang.ArrayIndexOutOfBoundsException: -1 at org.apache.hadoop.hive.ql.exec.FileSinkOperator.process(FileSinkOperator.java:781) at org.apache.hadoop.hive.ql.exec.Operator.forward(Operator.java:838) at org.apache.hadoop.hive.ql.exec.SelectOperator.process(SelectOperator.java:88) at org.apache.hadoop.hive.ql.exec.tez.ReduceRecordSource$GroupIterator.next(ReduceRecordSource.java:361) ... 17 more ], TaskAttempt 3 failed, info=[Error: Failure while running task:java.lang.RuntimeException: java.lang.RuntimeException: org.apache.hadoop.hive.ql.metadata.HiveException: Hive Runtime Error while processing row (tag=0) {"key":{"reducesinkkey0":{"transactionid":0,"bucketid":-1,"rowid":0}},"value":null} at org.apache.hadoop.hive.ql.exec.tez.TezProcessor.initializeAndRunProcessor(TezProcessor.java:171) at org.apache.hadoop.hive.ql.exec.tez.TezProcessor.run(TezProcessor.java:137) at org.apache.tez.runtime.LogicalIOProcessorRuntimeTask.run(LogicalIOProcessorRuntimeTask.java:344) at org.apache.tez.runtime.task.TezTaskRunner$TaskRunnerCallable$1.run(TezTaskRunner.java:179) at org.apache.tez.runtime.task.TezTaskRunner$TaskRunnerCallable$1.run(TezTaskRunner.java:171) at java.security.AccessController.doPrivileged(Native Method) at javax.security.auth.Subject.doAs(Subject.java:422) at org.apache.hadoop.security.UserGroupInformation.doAs(UserGroupInformation.java:1657) at org.apache.tez.runtime.task.TezTaskRunner$TaskRunnerCallable.callInternal(TezTaskRunner.java:171) at org.apache.tez.runtime.task.TezTaskRunner$TaskRunnerCallable.callInternal(TezTaskRunner.java:167) at org.apache.tez.common.CallableWithNdc.call(CallableWithNdc.java:36) at java.util.concurrent.FutureTask.run(FutureTask.java:266) at java.util.concurrent.ThreadPoolExecutor.runWorker(ThreadPoolExecutor.java:1142) at java.util.concurrent.ThreadPoolExecutor$Worker.run(ThreadPoolExecutor.java:617) at java.lang.Thread.run(Thread.java:745) Caused by: java.lang.RuntimeException: org.apache.hadoop.hive.ql.metadata.HiveException: Hive Runtime Error while processing row (tag=0) {"key":{"reducesinkkey0":{"transactionid":0,"bucketid":-1,"rowid":0}},"value":null} at org.apache.hadoop.hive.ql.exec.tez.ReduceRecordSource.pushRecord(ReduceRecordSource.java:302) at org.apache.hadoop.hive.ql.exec.tez.ReduceRecordProcessor.run(ReduceRecordProcessor.java:249) at org.apache.hadoop.hive.ql.exec.tez.TezProcessor.initializeAndRunProcessor(TezProcessor.java:148) ... 14 more Caused by: org.apache.hadoop.hive.ql.metadata.HiveException: Hive Runtime Error while processing row (tag=0) {"key":{"reducesinkkey0":{"transactionid":0,"bucketid":-1,"rowid":0}},"value":null} at org.apache.hadoop.hive.ql.exec.tez.ReduceRecordSource$GroupIterator.next(ReduceRecordSource.java:370) at org.apache.hadoop.hive.ql.exec.tez.ReduceRecordSource.pushRecord(ReduceRecordSource.java:292) ... 16 more Caused by: java.lang.ArrayIndexOutOfBoundsException: -1 at org.apache.hadoop.hive.ql.exec.FileSinkOperator.process(FileSinkOperator.java:781) at org.apache.hadoop.hive.ql.exec.Operator.forward(Operator.java:838) at org.apache.hadoop.hive.ql.exec.SelectOperator.process(SelectOperator.java:88) at org.apache.hadoop.hive.ql.exec.tez.ReduceRecordSource$GroupIterator.next(ReduceRecordSource.java:361) ... 17 more ]], Vertex did not succeed due to OWN_TASK_FAILURE, failedTasks:1 killedTasks:0, Vertex vertex_1465976940057_0697_4_01 [Reducer 2] killed/failed due to:OWN_TASK_FAILURE]DAG did not succeed due to VERTEX_FAILURE. failedVertices:1 killedVertices:0
{noformat}